program: Gaussian 09
title: 000029373
version: EM64L-G09RevD.01
frameworkgroup: C1[X(C7H12O2)]
method: RPBEPBE
basis: SDD
operation: Freq
keyword: #pfreq=noraman
keyword: PBEPBE/SDD
title: #p freq=noraman PBEPBE/SDD
converged: NO YES NO NO
title: Mulliken charges:
elementType: O O C C C C C C C H H H H H H H H H H H H
charge: -0.430816 -0.256436 -0.348702 -0.344325 -0.453572 -0.691074 -0.072240 -0.336299 0.171003 0.210073 0.198319 0.194797 0.198440 0.214300 0.208391 0.211749 0.212528 0.218668 0.260483 0.259156 0.375557
chargesum: 0.00000
title: Mulliken charges with hydrogens summed into heavy atoms:
elementType: O O C C C C C C C
charge: -0.055259 -0.256436 0.059690 0.048912 -0.030881 -0.048129 0.188243 -0.077143 0.171003
polarizability: 1.27924010e+02 1.64031714e+00 7.40205305e+01 8.95416286e+00 4.07951101e+00 6.02106170e+01
1716.lowfreq: -8.8029 -3.4276 -0.0008 -0.0005 -0.0004 11.5485 36.1846 63.6353 70.1719
frequency: 36.1336 63.5900 70.1581 109.9261 154.4566 180.8835 212.0152 236.6553 283.8797 378.6226 438.4357 476.3452 589.9093 610.6224 690.2978 729.5153 783.0052 856.8656 884.0347 908.9539 937.7797 990.1888 1010.6369 1023.9614 1068.2339 1070.4817 1103.7575 1149.0063 1201.2228 1230.8117 1249.5706 1273.8105 1283.8839 1293.7688 1313.1978 1343.9091 1349.3879 1391.0978 1455.5723 1466.9676 1476.5601 1478.3886 1487.2364 1638.0397 1662.2812 2956.7882 2965.8088 2975.1277 2976.8566 3007.2033 3025.3481 3048.7114 3072.7634 3075.4594 3092.0930 3155.7894 3522.0224
redmass: 4.0541 2.0776 3.7114 2.3358 2.8529 3.4663 2.4860 1.1707 3.9861 2.9270 3.1842 3.7115 1.3345 3.8033 3.1234 1.0818 1.2489 1.8608 1.9125 2.1782 1.9153 1.3729 1.9254 2.4093 2.4197 1.6361 2.0434 2.0879 1.4665 1.3736 1.3528 1.2494 1.1376 1.1888 1.4793 1.6461 1.7545 1.2127 1.0940 1.0702 1.0677 1.0429 1.0813 8.4609 6.2438 1.0623 1.0586 1.0403 1.0565 1.0980 1.0984 1.1030 1.1009 1.0993 1.0909 1.0925 1.0640
irintensity: 0.4323 0.1209 0.3369 0.4457 0.8675 1.1311 0.4233 0.1358 1.9096 2.7795 6.5559 27.4838 96.4834 22.2005 66.8941 10.6896 5.9601 4.1829 1.3728 3.9869 33.4028 36.9161 27.5903 242.9601 19.2850 109.9922 7.7417 25.7000 2.9433 2.5083 7.3822 2.0982 4.6384 6.5080 12.1559 21.4475 37.1416 11.6643 5.4389 0.8954 5.3950 12.7198 17.9405 259.6211 129.0881 11.9176 10.4760 21.5593 81.3844 4.4606 4.8806 40.0150 86.9259 49.9667 10.8483 6.6160 38.2445
temp: 298.150 k
press: 1.00000 atm
elementType: 8 8 6 6 6 6 6 6 6 1 1 1 1 1 1 1 1 1 1 1 1
symmnumber: 1
zpe: 463660.8 jmol-1
zpe.correction: 0.176599 hartree
zpe.thermalcorrener: 0.187374 hartree
zpe.thermalcorrenthalpy: 0.188318 hartree
zpe.thermalcorrgfe: 0.138983 hartree
zpe.sumelectzpe: -423.665652 hartree
zpe.sumelectthermal: -423.654877 hartree
zpe.sumelectthermalent: -423.653933 hartree
zpe.sumelectthermalfe: -423.703268 hartree
dipole: 2.0052 -1.2821 -0.0208
dipole: 2.3801
quadrupole: -51.4084 -59.3629 -55.4065
quadrupole: 3.1004 3.1347 -0.5331
quadrupole: 3.9842 -3.9703 -0.0139 3.1004 3.1347 -0.5331
hfenergy: -423.8422513 hartree
pointgroup: C01 [X(C7H12O2)]
dipole: 0.7935192 -0.4971249 -0.0082083 debye
dipolederiv: -1.0228871 -0.514636 -0.2700835 -0.4856815 -0.59554 -0.1641087 -0.2937362 -0.1829582 -0.5601271 -0.7722454 0.1883617 -0.0348161 0.2572017 -0.92864 -0.1300889 -0.0366527 -0.1219184 -0.3858791 0.036912 0.0177013 0.008987 0.2308365 0.1155312 0.066131 -0.098566 0.045778 0.1289079 0.0673921 -0.0063967 0.0254427 -0.1128371 0.122223 0.0415083 0.099205 0.0433971 0.1436525 -0.3668178 0.0120681 0.0048019 -0.0927278 0.1127323 0.0178341 -0.0122937 0.0530434 0.115098 -0.0927174 -0.0371085 0.0484688 0.0192097 0.0646071 0.0299011 0.0116255 0.0294106 0.060438 0.6665658 -0.0464701 0.1535797 0.0087055 0.0763887 0.0969032 0.3083484 0.0615966 -0.0744712 -0.9976931 0.0544259 -0.1148072 -0.013987 0.0320562 0.0543652 -0.2332728 0.0737002 -0.2053539 1.9239771 0.123322 0.4028335 -0.1708828 1.2109267 0.2590412 0.3692622 0.30746 0.4492073 0.0307775 -0.0001125 -0.0399687 -0.0108248 0.0649047 -0.0062926 -0.0245668 0.0173252 -0.1621948 0.0503534 0.0080647 0.0120927 0.0076428 -0.1707032 -0.0380583 0.0047778 -0.0648237 0.0531565 0.0193547 -0.00011 -0.0127613 0.0016511 0.071237 -0.0042625 -0.0490765 0.0239872 -0.2054491 0.0314381 -0.0339135 0.0041162 0.0129026 -0.1941969 -0.0370749 0.0074383 -0.0588798 0.0613543 0.0272026 -0.0187293 -0.0015211 0.0164863 -0.1452992 -0.0284777 0.0257638 -0.0748885 0.0629183 0.018833 0.0093107 -0.088566 0.0631064 0.0845776 -0.0103504 -0.0411968 0.007587 -0.1243805 0.0919469 0.014863 0.0195134 -0.0485007 -0.1690509 -0.0462638 0.0105858 -0.0758944 0.0601605 0.0832866 -0.0134397 -0.0727217 -0.0263695 0.0805931 -0.0119366 -0.0078667 0.0078283 -0.1760992 -0.2142789 0.0672264 -0.0114022 0.0870862 0.0540112 0.0233721 -0.020615 0.0273728 0.0855021 0.0810327 0.0206781 -0.0111349 0.0423281 -0.0442724 -0.0461854 -0.022081 -0.0411233 0.1294634 0.0739565 0.0401021 -0.0174835 0.0532676 -0.0422844 -0.0509833 -0.0103423 -0.0522988 0.1549084 0.2636107 0.1147924 -0.0045695 0.1613869 0.2001983 -0.014973 0.0132598 -0.0257013 0.3891878 unknown
polarizability: 127.8682116|2.1129525|74.0392863|9.0001711|4.190379|60.2476593 unknown
InChI: InChI=1S/C7H12O2/c1-2-3-4-5-6-7(8)9/h5-6,8H,2-4H2,1H3
charge 0 multiplicity 1
21 atoms
O  -3.734356 -0.769202 -0.641663
O  -3.032508 1.303738 0.149481
C  2.093667 0.241552 -0.099809
C  3.507332 -0.335408 0.140229
C  0.997347 -0.52446 0.694004
C  4.598937 0.41869 -0.64862
C  -0.370849 0.076349 0.511627
C  -1.461686 -0.579859 0.024739
C  -2.76051 0.107295 -0.124833
H  1.854722 0.204543 -1.181062
H  2.078044 1.312162 0.189804
H  3.737403 -0.297102 1.224624
H  3.517305 -1.407514 -0.143034
H  0.995533 -1.590761 0.397865
H  1.266783 -0.487665 1.771449
H  4.632429 1.485783 -0.35892
H  4.405314 0.372748 -1.736729
H  5.59973 -0.012927 -0.464969
H  -0.4953 1.136392 0.784455
H  -1.424507 -1.632849 -0.273014
H  -4.59383 -0.274706 -0.728321
