program: Gaussian 09
title: 000029437
version: EM64L-G09RevD.01
frameworkgroup: C1[X(C20H22N2)]
method: RPBEPBE
basis: SDD
operation: Freq
keyword: #pfreq=noraman
keyword: PBEPBE/SDD
title: #p freq=noraman PBEPBE/SDD
converged: YES YES NO NO
title: Mulliken charges:
elementType: N N C C C C C C C C C C C C C C C C C C C C H H H H H H H H H H H H H H H H H H H H H H
charge: -0.177612 -0.419336 -0.118905 -0.488339 -0.443469 -0.370724 0.362925 -0.495868 0.099422 -0.433885 0.087184 0.448558 -0.441528 0.377392 -0.242322 -0.430576 -0.445553 -0.377365 -0.827552 -0.222281 -0.238692 -0.246756 0.199731 0.235619 0.211085 0.205542 0.224092 0.178300 0.238998 0.194361 0.249252 0.281037 0.311168 0.230623 0.217209 0.223302 0.230562 0.258061 0.224513 0.225436 0.236212 0.222896 0.221831 0.225454
chargesum: 0.00000
title: Mulliken charges with hydrogens summed into heavy atoms:
elementType: N N C C C C C C C C C C C C C C C C C C C C
charge: -0.177612 -0.108168 0.080826 -0.041635 -0.013835 0.046574 0.362925 -0.052256 0.099422 -0.152848 0.087184 0.448558 -0.210905 0.377392 -0.025113 -0.207274 -0.214991 -0.119305 -0.141391 0.000615 -0.016861 -0.021302
polarizability: 2.93329713e+02 7.39000509e+00 1.95740889e+02 2.11611344e+01 2.12237547e+01 1.88043777e+02
1716.lowfreq: -18.3232 -5.4144 -0.0001 0.0003 0.0004 2.6574 9.7545 17.7071 25.1831
frequency: -11.4884 17.4707 25.1300 38.2699 69.7448 81.1461 108.9966 123.7899 139.9215 162.7936 187.2839 210.7756 231.0928 244.4105 256.6304 309.3379 315.6445 348.6271 406.4629 419.1633 465.2542 482.3139 492.2707 506.3525 514.4624 573.3930 578.3506 610.8029 612.8757 616.5006 620.5242 649.9118 673.8619 705.4554 727.2221 748.3545 750.8417 788.4906 801.1587 806.7602 818.4928 843.6673 859.6259 869.7742 885.2494 887.7069 914.0038 925.8425 937.6144 958.9576 965.6717 982.7653 989.5173 993.9636 1002.8586 1009.0813 1025.0667 1042.7626 1045.2559 1063.6854 1073.2968 1081.0740 1087.9339 1108.3531 1128.0474 1157.9759 1167.5649 1174.9558 1176.5574 1178.6736 1200.0552 1215.6830 1222.4237 1235.4074 1257.4064 1260.9060 1268.2372 1282.6070 1290.1568 1299.0505 1309.5751 1315.6874 1341.4541 1355.6970 1367.3492 1388.5022 1391.7389 1403.2293 1404.3176 1440.0118 1447.8547 1458.6708 1465.9109 1471.3642 1478.8294 1480.3914 1481.9407 1491.2259 1495.2794 1560.3878 1593.2029 1599.6736 1614.9879 1626.3051 2811.5752 2840.1707 2851.2482 2959.6156 2994.6780 3011.8462 3024.2825 3029.5404 3050.1720 3068.0246 3084.5483 3091.8693 3110.8646 3118.1825 3119.5326 3130.8476 3133.1755 3143.5147 3153.8705 3159.3079 3233.5175 3615.2277
redmass: 2.3864 4.4658 4.8800 3.4872 3.2947 3.6498 3.8647 1.0482 4.3425 2.3477 3.5456 3.8648 3.8149 3.2670 3.2606 3.9960 3.8241 2.4057 2.8616 4.9097 2.9317 3.2968 2.2712 3.2110 1.9575 4.3043 2.9105 4.5764 4.4151 4.0639 3.9084 3.1419 5.0241 2.2498 1.9251 1.8549 1.7506 2.2250 2.7338 2.3478 1.6398 3.5718 1.2713 2.7305 1.4770 1.8237 1.4626 2.4462 2.3178 1.3405 1.9386 1.3939 4.5382 1.6838 1.8792 1.9281 2.1208 1.5112 2.4208 1.8827 1.6918 1.6953 1.8015 2.3646 1.8277 2.1329 1.0737 1.3740 1.2721 1.2891 1.6255 1.6780 1.6111 2.5062 1.4241 1.6857 1.2687 1.2162 2.1538 1.4346 1.8241 1.3582 1.4900 1.7851 2.0617 4.0512 1.5706 1.9976 2.7867 2.1355 3.2331 1.1316 1.0829 1.0456 1.3923 1.0938 2.1995 1.1478 2.3121 6.5644 6.2025 6.5853 6.1456 6.9301 1.0802 1.0720 1.0706 1.0385 1.0850 1.0589 1.0639 1.0977 1.0880 1.1041 1.0963 1.1051 1.0866 1.0859 1.0861 1.0911 1.0913 1.0955 1.0988 1.1014 1.0981 1.0806
irintensity: 0.4865 0.5160 0.0229 0.0237 1.5263 0.1949 0.9279 0.2476 0.1240 1.4656 0.6849 2.5898 4.6675 4.4864 2.6408 0.4893 2.3316 4.6681 0.1124 0.4975 7.1511 14.7964 35.9898 18.3818 32.2128 1.6947 6.4209 4.9926 0.5829 0.9386 0.3499 2.8374 1.8307 25.0545 25.0496 33.4176 55.7482 32.2316 9.9842 9.2269 15.4641 3.4892 0.4271 12.6213 4.4379 15.7097 7.4688 9.0748 3.7802 0.3263 3.0453 0.0062 0.2966 1.3734 1.2827 7.6552 18.5925 6.8617 9.8527 18.9429 23.1595 2.9264 4.7449 50.3673 6.9589 22.6518 0.5629 4.7424 2.6064 4.5594 8.4552 12.5903 9.1250 6.2472 15.2793 1.6331 7.6072 7.3997 3.6622 4.7263 21.3905 5.4949 3.2046 8.4761 26.1938 13.5252 17.9935 7.3920 32.1279 8.6174 15.7707 4.6437 1.3534 14.4647 15.1161 7.6757 22.3110 0.1505 3.9156 4.8027 1.0991 4.1324 14.0557 2.1230 44.9599 30.4694 170.2191 47.7716 10.8347 30.0140 56.7658 26.4562 40.3706 5.3824 19.5462 49.7678 8.7910 4.0037 0.0575 26.2804 17.6193 39.0582 33.5360 31.5472 0.1491 49.4320
temp: 298.150 k
press: 1.00000 atm
elementType: 7 7 6 6 6 6 6 6 6 6 6 6 6 6 6 6 6 6 6 6 6 6 1 1 1 1 1 1 1 1 1 1 1 1 1 1 1 1 1 1 1 1 1 1
symmnumber: 1
zpe: 969148.5 jmol-1
zpe.correction: 0.369129 hartree
zpe.thermalcorrener: 0.387677 hartree
zpe.thermalcorrenthalpy: 0.388622 hartree
zpe.thermalcorrgfe: 0.320555 hartree
zpe.sumelectzpe: -883.257922 hartree
zpe.sumelectthermal: -883.239374 hartree
zpe.sumelectthermalent: -883.238430 hartree
zpe.sumelectthermalfe: -883.306496 hartree
dipole: 0.1903 -0.9143 -0.9759
dipole: 1.3508
quadrupole: -127.6243 -122.5470 -123.7216
quadrupole: -4.9119 -2.2992 7.6616
quadrupole: -2.9934 2.0840 0.9094 -4.9119 -2.2992 7.6616
hfenergy: -883.6270514 hartree
pointgroup: C01 [X(C20H22N2)]
dipole: -0.1024586 0.2747032 -0.4432602 debye
polarizability: 290.6014125|3.2547804|187.2169131|-26.9845736|-21.5312949|199.2960536 unknown
InChI: InChI=1S/C20H22N2/c1-15-7-5-10-17-18(13-21-20(15)17)19-11-6-12-22(19)14-16-8-3-2-4-9-16/h2-5,7-10,13,19,21H,6,11-12,14H2,1H3
charge 0 multiplicity 1
44 atoms
N  1.326145 -1.134336 0.073315
N  -2.150436 1.048943 -1.359279
C  -0.077428 -1.539332 0.389637
C  -0.195682 -2.967539 -0.250469
C  1.274408 -3.439124 -0.494921
C  2.140325 -2.367611 0.20452
C  -1.096682 -0.541925 -0.100864
C  1.820269 0.023438 0.84142
C  -2.425101 -0.322432 0.446157
C  -0.968167 0.309208 -1.198754
C  -3.064194 0.682393 -0.362193
C  3.101382 0.625038 0.269289
C  -3.14017 -0.877028 1.542608
C  -4.378881 1.157458 -0.123576
C  -4.445466 -0.417075 1.795974
C  -5.051627 0.581905 0.976062
C  4.024558 1.28302 1.11953
C  3.368343 0.581171 -1.122412
C  -5.010048 2.219333 -1.004633
C  5.183123 1.897309 0.591677
C  4.527613 1.189262 -1.652915
C  5.439015 1.853541 -0.798477
H  -0.202768 -1.64978 1.499743
H  -0.759858 -2.912293 -1.196048
H  -0.745181 -3.646243 0.425023
H  1.470557 -4.449399 -0.095424
H  1.494718 -3.453944 -1.576244
H  2.300979 -2.635381 1.280883
H  3.132733 -2.232626 -0.258634
H  1.985092 -0.234184 1.919765
H  1.021663 0.791643 0.821339
H  -0.115806 0.439247 -1.861704
H  -2.307144 1.75923 -2.070224
H  -2.687344 -1.647482 2.176676
H  -5.014627 -0.829631 2.636735
H  -6.071765 0.914256 1.204279
H  3.836062 1.314279 2.200473
H  2.659058 0.05245 -1.769501
H  -4.425026 3.160643 -0.995527
H  -5.084402 1.886159 -2.059035
H  -6.029991 2.461878 -0.6622
H  5.886928 2.402919 1.263002
H  4.722453 1.144882 -2.731004
H  6.33897 2.325461 -1.209068
