program: Gaussian 09
title: 000029379
version: EM64L-G09RevD.01
frameworkgroup: C1[X(C17H17ClN2)]
method: RPBEPBE
basis: SDD
operation: Freq
keyword: #p
keyword: freq=noraman
keyword: PBEPBE/SDD
title: #p freq=noraman PBEPBE/SDD
converged: YES YES NO NO
title: Mulliken charges:
elementType: Cl N N C C C C C C C C C C C C C C C C C H H H H H H H H H H H H H H H H H
charge: -0.083501 -0.064800 -0.415028 -0.317140 -0.424102 0.236676 -0.386820 -0.542005 0.327463 0.247961 -0.454008 0.272139 -0.374188 -0.390598 -0.324039 -0.421047 -0.255854 -0.248298 -0.158238 -0.223553 0.265747 0.218162 0.218226 0.210191 0.224263 0.234734 0.210961 0.229354 0.219944 0.281242 0.248002 0.232123 0.281499 0.220409 0.227874 0.225565 0.250683
chargesum: 0.00000
title: Mulliken charges with hydrogens summed into heavy atoms:
elementType: Cl N N C C C C C C C C C C C C C C C C C
charge: -0.083501 -0.064800 -0.133786 -0.051393 0.012286 0.236676 0.047634 -0.096310 0.327463 0.247961 -0.004710 0.272139 -0.126186 -0.158476 -0.042539 -0.200638 -0.027981 -0.022733 -0.158238 0.027131
polarizability: 2.22364945e+02 1.20359241e+01 2.25660549e+02 -1.45476554e+01 -2.10939189e+00 1.51253636e+02
1716.lowfreq: -3.4189 0.0010 0.0010 0.0016 2.7080 8.9054 45.5892 51.4373 69.4998
frequency: 45.5856 51.4299 69.4928 110.6452 132.9804 145.1324 182.3171 201.7649 222.0376 257.4011 287.6368 309.3381 324.4926 345.4853 355.7927 387.6239 414.5857 432.8472 450.6014 462.7040 482.0623 497.4709 512.4414 550.9504 567.5365 585.3818 629.1379 646.3408 658.2302 712.7617 732.9250 747.0863 758.6879 782.2375 800.2553 804.9708 846.3154 876.6066 880.5943 897.3843 905.3317 925.9317 932.6546 954.9004 968.3446 987.8680 998.9490 1038.9330 1050.1895 1068.5105 1076.4161 1087.6205 1103.1967 1115.1218 1135.6301 1144.9691 1164.8726 1174.4515 1202.1887 1207.8808 1222.6450 1224.3301 1235.3836 1249.1713 1268.2009 1274.4795 1295.5623 1306.2168 1328.3201 1335.4335 1344.6918 1362.7913 1371.9356 1385.5777 1392.2483 1406.8549 1440.7563 1444.5152 1468.4640 1470.5363 1477.9682 1483.3649 1490.8197 1503.1834 1581.3481 1593.9235 1602.3344 1615.8269 2870.9012 2879.7236 2968.5280 2977.9524 2978.2529 3007.1381 3016.7801 3026.3316 3034.2741 3113.1074 3118.5744 3120.4896 3138.3219 3157.7443 3160.1150 3167.0444 3542.6222
redmass: 5.5355 5.1827 4.5112 3.6859 4.2117 5.1306 3.3277 3.5505 3.3100 2.9656 3.8235 3.0014 4.6345 3.9537 6.2142 4.5532 3.8918 2.9368 2.2387 3.4889 1.9959 3.9824 3.1594 3.8537 3.5363 3.5159 4.9442 4.3936 4.6634 3.2526 3.8281 1.9645 2.3150 2.1239 2.9668 1.7437 2.8358 1.9755 1.9291 1.7049 2.7701 1.4681 2.1200 1.4879 2.2370 1.3213 2.3043 2.3196 2.1913 2.4292 2.4350 2.0203 2.7127 2.2065 2.8675 1.9537 1.7167 1.0678 1.7665 1.4049 1.6842 1.2282 1.3754 1.5117 1.5339 1.5779 1.3956 1.7613 1.3513 1.7123 1.4877 1.5798 2.0458 5.4071 1.4805 4.0219 2.2347 1.1533 1.1476 1.7336 1.7539 1.1104 2.4295 1.3009 5.6262 6.9282 6.4245 6.4008 1.0711 1.0708 1.0611 1.0611 1.0810 1.0910 1.1012 1.0888 1.1006 1.0868 1.0894 1.0886 1.0932 1.0918 1.1005 1.0953 1.0760
irintensity: 0.0902 0.2113 0.6457 3.6545 0.7193 1.1241 1.5070 3.0025 1.6731 3.1572 1.7793 0.8483 6.5930 1.0560 3.7871 0.9812 3.9641 8.3051 24.5942 1.3184 53.7808 15.1706 2.8640 9.3290 31.1146 0.3247 12.9660 17.7738 11.4918 11.0824 11.5341 19.1060 42.3857 10.4657 8.8049 41.8476 7.0493 7.8921 1.6698 7.3182 2.4106 0.7976 4.7824 1.8853 7.2098 0.1066 4.6377 5.0720 3.2721 2.5031 11.7252 24.4744 19.1538 35.4792 9.9705 14.8832 15.6642 1.2725 0.8831 0.1266 3.8512 3.8654 5.2479 9.3979 6.1129 12.5541 11.5074 84.1640 23.5737 17.2730 0.6121 6.3803 19.5072 0.2734 8.4753 16.6561 3.2098 14.4013 15.5697 121.3436 11.7363 7.3975 18.5829 76.1273 0.4421 1.7818 27.2110 2.9389 20.9470 108.5227 65.4373 29.7288 17.9013 61.4465 53.3036 57.2514 25.9849 12.1734 19.8606 2.9325 28.8414 0.3953 32.4330 6.9160 16.1160
temp: 298.150 k
press: 1.00000 atm
elementType: 17 7 7 6 6 6 6 6 6 6 6 6 6 6 6 6 6 6 6 6 1 1 1 1 1 1 1 1 1 1 1 1 1 1 1 1 1
symmnumber: 1
zpe: 788686.1 jmol-1
zpe.correction: 0.300395 hartree
zpe.thermalcorrener: 0.316601 hartree
zpe.thermalcorrenthalpy: 0.317545 hartree
zpe.thermalcorrgfe: 0.256918 hartree
zpe.sumelectzpe: -1226.135214 hartree
zpe.sumelectthermal: -1226.119008 hartree
zpe.sumelectthermalent: -1226.118064 hartree
zpe.sumelectthermalfe: -1226.178691 hartree
dipole: 0.3535 4.0644 -0.1437
dipole: 4.0823
quadrupole: -116.4810 -119.4835 -121.5819
quadrupole: 14.7024 -8.0319 2.9141
quadrupole: 2.7011 -0.3013 -2.3998 14.7024 -8.0319 2.9141
hfenergy: -1226.4356088 hartree
pointgroup: C01 [X(C17H17Cl1N2)]
dipole: 0.5009927 1.5102905 -0.2182201 debye
polarizability: 227.9229635|9.8923657|219.6209987|-15.7124969|-6.0458542|151.735168 unknown
InChI: InChI=1S/C17H17ClN2/c18-13-5-6-16-15(11-13)17-14-4-2-1-3-12(14)7-9-20(17)10-8-19-16/h1-6,11,17,19H,7-10H2
charge 0 multiplicity 1
37 atoms
Cl 1.827889 -3.798262 1.429441
N  -0.233786 2.021147 0.428025
N  2.479641 1.602078 -1.248864
C  -0.197192 0.824663 -0.473799
C  -0.816995 1.718896 1.756908
C  -1.538076 0.091474 -0.472881
C  1.076064 2.710861 0.540336
C  -2.307369 1.379003 1.595093
C  1.011725 -0.095121 -0.196405
C  -2.532062 0.336469 0.510257
C  1.794469 2.849709 -0.815703
C  2.30425 0.343871 -0.635243
C  -1.790103 -0.860215 -1.493849
C  -3.754614 -0.381674 0.450542
C  0.888748 -1.348264 0.444615
C  3.420592 -0.526577 -0.481939
C  -3.008809 -1.565592 -1.549339
C  -3.999665 -1.325933 -0.567134
C  2.016297 -2.174412 0.603971
C  3.282754 -1.791182 0.125832
H  -0.044995 1.216643 -1.499105
H  -0.70253 2.617046 2.392135
H  -0.279745 0.882322 2.268373
H  1.768962 2.19671 1.251476
H  0.886085 3.723695 0.945704
H  -2.849722 2.30572 1.32215
H  -2.725662 1.027943 2.558269
H  1.070032 3.200592 -1.577191
H  2.563292 3.640855 -0.712508
H  3.39513 1.744269 -1.678123
H  -1.015105 -1.051795 -2.246101
H  -4.519463 -0.192211 1.214417
H  -0.096244 -1.693014 0.77324
H  4.410391 -0.204303 -0.829115
H  -3.185458 -2.295736 -2.346726
H  -4.949634 -1.871347 -0.595966
H  4.146806 -2.452429 0.239305
