program: Gaussian 09
title: 000029355
version: EM64L-G09RevD.01
frameworkgroup: C1[X(C8H9ClO)]
method: RPBEPBE
basis: SDD
operation: Freq
keyword: #p
keyword: freq=noraman
keyword: PBEPBE/SDD
title: #p freq=noraman PBEPBE/SDD
converged: NO YES NO NO
title: Mulliken charges:
elementType: Cl O C C C C C C C C H H H H H H H H H
charge: -0.031440 -0.410890 0.523940 -0.532461 -0.392698 -0.395257 -0.669114 -0.260210 -0.354947 0.364918 0.209080 0.212123 0.258517 0.235468 0.224357 0.218058 0.220856 0.220303 0.359397
chargesum: 0.00000
title: Mulliken charges with hydrogens summed into heavy atoms:
elementType: Cl O C C C C C C C C
charge: -0.031440 -0.051493 0.523940 -0.111258 -0.134180 -0.159790 -0.005843 -0.260210 -0.134644 0.364918
polarizability: 1.34061885e+02 -2.04276668e+00 1.07368495e+02 5.88570239e+00 2.24205293e+00 5.18938253e+01
1716.lowfreq: -9.5439 -2.8316 0.0016 0.0023 0.0029 2.4410 25.4658 98.1111 150.9045
frequency: 25.2010 98.1019 150.9032 188.6346 225.7420 240.2580 294.3767 347.1013 380.9637 387.2041 434.5866 473.4883 484.8991 601.1245 669.8342 714.5404 733.8386 786.4674 801.7078 854.2612 885.3963 930.8292 975.5162 1030.7174 1052.4499 1063.0130 1121.0872 1161.5660 1211.5783 1241.1442 1260.3312 1286.0438 1312.9163 1386.4160 1389.2602 1404.5790 1471.0897 1473.3437 1488.1905 1498.9336 1581.2284 1621.7643 2978.8670 2987.8568 3038.5767 3077.9063 3083.7011 3111.9323 3139.9620 3146.0219 3578.3220
redmass: 2.5446 4.2012 5.0779 2.0969 1.9906 4.3780 2.5645 1.1161 5.2218 4.6826 3.1719 4.5958 4.1739 3.5911 6.3781 3.7239 4.1476 1.1952 1.4481 5.2143 1.4364 1.3469 2.3837 3.1038 1.5092 1.9894 1.4257 1.1926 1.9068 1.2676 2.9989 1.3450 1.5626 4.3328 1.2859 3.2916 1.0435 1.0743 1.1141 2.7019 6.6664 7.0343 1.0349 1.0601 1.1016 1.1001 1.1013 1.0878 1.0953 1.0931 1.0661
irintensity: 0.2500 0.5452 2.1896 0.0939 1.3981 2.0763 4.8240 138.7732 0.3455 0.8655 9.1847 4.2968 9.1272 14.9581 6.4123 3.3616 31.9761 5.8193 44.8162 20.7824 15.1221 0.0792 8.2018 26.3037 17.4267 12.9786 151.3906 47.8212 27.4415 1.4240 50.5594 27.9051 2.1689 18.2690 9.8524 12.8520 14.8788 1.7986 7.0291 92.4024 13.0030 7.4633 38.6750 35.4528 7.4223 57.0608 40.6508 15.1998 16.6374 1.8355 42.1366
temp: 298.150 k
press: 1.00000 atm
elementType: 17 8 6 6 6 6 6 6 6 6 1 1 1 1 1 1 1 1 1
symmnumber: 1
zpe: 388091.2 jmol-1
zpe.correction: 0.147816 hartree
zpe.thermalcorrener: 0.157828 hartree
zpe.thermalcorrenthalpy: 0.158773 hartree
zpe.thermalcorrgfe: 0.111408 hartree
zpe.sumelectzpe: -844.787173 hartree
zpe.sumelectthermal: -844.777161 hartree
zpe.sumelectthermalent: -844.776217 hartree
zpe.sumelectthermalfe: -844.823581 hartree
dipole: -2.5114 2.6303 -0.0281
dipole: 3.6368
quadrupole: -66.3546 -55.3683 -69.3999
quadrupole: 6.6667 1.1118 1.4228
quadrupole: -2.6470 8.3393 -5.6923 6.6667 1.1118 1.4228
hfenergy: -844.9349891 hartree
pointgroup: C01 [X(C8H9Cl1O1)]
dipole: 0.8405184 -1.1577985 -0.0170239 debye
dipolederiv: -0.3866563 0.2965015 0.0247054 0.3854538 -0.4758813 -0.0244675 0.0283938 -0.019127 -0.054465 -1.3461009 -0.375455 0.1255572 -0.3170638 -0.1033346 0.0249124 0.1507012 0.0397439 -0.4178312 0.2429644 0.0671524 -0.0070586 0.0727537 -0.09791 -0.0024334 -0.0020095 0.0006288 -0.104437 0.0619586 -0.0234935 -0.0287385 -0.0061822 0.1263784 -0.0058805 -0.1583151 -0.026407 0.1099972 -0.1418299 0.0077286 -0.0088269 0.1478513 -0.0569729 -0.0186105 -0.0038929 0.0037788 -0.1050655 -0.0566362 0.0943045 -0.0318692 -0.1224449 0.1033029 -0.0003951 -0.0059639 -0.0309431 -0.1482167 -0.0275772 -0.0161948 -0.0398363 -0.0191206 0.0740469 -0.0110306 0.0556866 0.0025317 -0.0007392 0.3571777 -0.447469 -0.0358734 -0.7749835 0.6534607 0.0505765 -0.0250394 0.024728 -0.0740847 -0.2087473 -0.1983115 0.0041019 0.1849007 0.0579379 -0.0286619 -0.0087408 0.0185636 -0.1804771 1.1113837 0.4978324 -0.1570217 0.4148977 -0.0593738 -0.0473605 -0.1695937 -0.0637143 0.103731 -0.0276894 0.0324074 0.0396439 0.0878407 -0.0563234 -0.1299698 0.0460299 -0.0757931 -0.0082516 0.0151128 0.0009033 -0.0129032 -0.0624095 -0.0752364 0.1356464 0.0191498 0.089138 -0.0173825 0.0881059 -0.0535306 0.018958 -0.0534805 -0.0271466 0.0137533 0.0169678 0.0145264 0.1435271 -0.0047588 0.1090561 0.0243359 0.1010868 -0.0111043 -0.003058 0.022434 -0.0064655 0.1438552 0.066059 0.0997561 0.0545977 0.0612634 -0.0456611 -0.1120522 0.0235039 -0.0715169 0.0027253 -0.2569426 -0.0663101 -0.0002241 -0.0726392 0.0943781 -0.0011072 -0.0091586 -0.0004399 0.0627811 0.1061011 -0.0424016 0.0099924 0.0014574 -0.0817807 0.1304987 -0.0047798 0.0786567 -0.0086122 0.0112314 -0.0891084 0.023933 -0.0764685 -0.0875269 0.0191284 0.0285557 0.0222705 0.1669374 0.3968438 0.1066322 -0.0034734 0.0472874 0.0687471 0.0105115 -0.0039291 -0.0001596 0.3860085 unknown
polarizability: 133.0342038|-5.4841069|108.4021167|-6.2013755|-1.1615417|51.8878847 unknown
InChI: InChI=1S/C8H9ClO/c1-2-6-3-4-8(10)7(9)5-6/h3-5,10H,2H2,1H3
charge 0 multiplicity 1
19 atoms
Cl -2.255671 2.11025 0.059238
O  -2.931152 -0.793868 0.300061
C  1.221369 -0.066975 -0.334884
C  2.705086 0.224878 -0.511123
C  0.281112 0.991751 -0.249692
C  0.742384 -1.394744 -0.205022
C  3.439015 0.401296 0.845426
C  -1.083716 0.728707 -0.03833
C  -0.626703 -1.660064 0.006712
C  -1.559346 -0.598053 0.093917
H  3.18307 -0.599245 -1.074813
H  2.838955 1.142878 -1.11448
H  0.610882 2.031546 -0.351314
H  1.446239 -2.23239 -0.274204
H  3.003949 1.237382 1.422449
H  4.512946 0.611813 0.688118
H  3.352567 -0.511788 1.462111
H  -0.980346 -2.695367 0.100579
H  -3.13704 -1.759106 0.375252
