program: Gaussian 09
title: 000029358
version: EM64L-G09RevD.01
frameworkgroup: C1[X(C10H13ClO)]
method: RPBEPBE
basis: SDD
operation: Freq
keyword: #p
keyword: freq=noraman
keyword: PBEPBE/SDD
title: #p freq=noraman PBEPBE/SDD
converged: NO YES NO NO
title: Mulliken charges:
elementType: Cl O C C C C C C C C C C H H H H H H H H H H H H H
charge: -0.033589 -0.410093 -0.355448 -0.559683 -0.339061 0.542541 -0.694519 -0.394715 -0.416506 -0.269054 -0.357880 0.361705 0.206229 0.204002 0.205702 0.203522 0.195469 0.194598 0.212521 0.211185 0.216959 0.259807 0.236697 0.219830 0.359783
chargesum: 0.00000
title: Mulliken charges with hydrogens summed into heavy atoms:
elementType: Cl O C C C C C C C C C C
charge: -0.033589 -0.050310 0.054782 -0.150459 0.051006 0.542541 -0.053854 -0.134908 -0.179809 -0.269054 -0.138050 0.361705
polarizability: 1.63363900e+02 4.63488123e+00 1.25737266e+02 -1.30060100e+01 4.62258416e+00 7.45884211e+01
1716.lowfreq: -9.4773 -6.9294 -4.4109 -0.0032 -0.0027 -0.0015 8.4610 56.6707 62.7669
frequency: 2.9578 56.6649 62.7310 103.7793 139.0400 181.4390 200.3447 229.3880 248.7598 283.0381 323.5289 339.2599 383.2089 414.4655 436.2526 483.3130 510.8525 599.8459 675.2242 713.2708 732.7535 761.6961 787.8572 800.1489 870.2461 877.0534 905.8589 920.0436 932.1946 1010.4926 1030.3900 1069.1673 1075.9921 1106.0469 1120.4945 1160.3327 1206.2034 1211.9895 1256.1829 1261.8654 1270.3033 1285.4632 1289.9504 1323.6349 1347.9422 1385.7782 1388.7064 1405.0506 1465.2802 1470.1135 1477.4482 1480.9791 1488.6326 1498.6431 1579.2691 1622.9164 2962.2871 2969.3837 2973.3967 2980.3634 3002.0816 3021.2209 3046.7305 3070.4099 3072.0704 3112.6038 3141.9274 3149.6639 3585.9005
redmass: 3.4289 4.3205 1.7452 2.2715 5.2732 4.2832 4.7283 1.1738 4.4535 3.3671 3.3878 1.2114 5.4258 3.4611 3.1156 4.2383 5.4836 3.8990 6.8305 3.6433 1.0766 4.7012 1.2032 1.4857 3.1603 1.8533 1.7024 1.2721 1.3641 4.1058 3.1081 2.5564 1.4195 2.1927 1.3939 1.1968 1.4936 1.9388 1.3389 2.6613 1.3302 1.1547 1.2418 1.4457 1.5650 5.4331 1.2134 3.3997 1.0723 1.0778 1.0426 1.0720 1.0899 3.0534 6.6837 7.1284 1.0587 1.0589 1.0370 1.0593 1.0990 1.1023 1.1046 1.1008 1.0993 1.0880 1.0954 1.0928 1.0661
irintensity: 0.5749 0.1677 0.0907 0.0737 0.5325 3.0783 0.3625 0.2426 0.8494 5.2251 9.5519 129.9747 0.9924 0.1890 8.5375 11.2609 7.6323 15.6648 14.0656 2.5183 7.6894 23.1558 2.4629 41.1560 18.9413 11.1616 9.3607 5.1756 0.2211 2.5524 27.7182 1.2980 23.1857 26.9990 145.9366 45.0007 1.9189 22.2930 4.0830 57.0560 1.4871 6.3752 17.3456 1.4263 0.4413 19.9941 11.5854 11.1759 0.0129 0.7058 12.7347 3.1934 17.5283 101.5949 13.8364 6.5386 13.7604 7.5157 37.5137 90.6928 2.7640 1.6849 39.7115 84.9305 55.6446 16.4868 15.9239 1.8368 44.7512
temp: 298.150 k
press: 1.00000 atm
elementType: 17 8 6 6 6 6 6 6 6 6 6 6 1 1 1 1 1 1 1 1 1 1 1 1 1
symmnumber: 1
zpe: 534446.8 jmol-1
zpe.correction: 0.203560 hartree
zpe.thermalcorrener: 0.216439 hartree
zpe.thermalcorrenthalpy: 0.217383 hartree
zpe.thermalcorrgfe: 0.160843 hartree
zpe.sumelectzpe: -923.233745 hartree
zpe.sumelectthermal: -923.220866 hartree
zpe.sumelectthermalent: -923.219922 hartree
zpe.sumelectthermalfe: -923.276462 hartree
dipole: 2.0861 3.0279 0.0382
dipole: 3.6771
quadrupole: -80.3746 -70.9762 -81.6208
quadrupole: -10.4940 -3.0092 3.2015
quadrupole: -2.7174 6.6810 -3.9636 -10.4940 -3.0092 3.2015
hfenergy: -923.4373053 hartree
pointgroup: C01 [X(C10H13Cl1O1)]
dipole: 0.7361628 1.2416694 -0.0961782 debye
dipolederiv: -0.3077323 -0.2672919 0.0518792 -0.373794 -0.5542344 0.0726564 0.0599775 0.0573473 -0.0664996 -1.3916009 0.2138214 0.2604831 0.1569417 -0.0378824 -0.0268471 0.3027631 -0.0485804 -0.4761811 -0.0365816 0.0169107 0.0003618 0.0096898 0.152611 0.0139102 0.1484238 0.0106668 0.0415262 -0.0883054 0.0385737 -0.0384463 0.0414024 0.1376544 0.0086412 -0.1745164 0.0127826 0.1323555 0.0539169 0.016243 -0.0226544 0.0286262 0.1808012 0.0112586 -0.1397283 0.0157676 0.0943241 0.301886 -0.0337265 -0.0616021 -0.0360463 -0.1084526 0.0107316 -0.0947005 0.0108438 -0.0844374 -0.0760199 0.0207305 -0.0630618 0.0195781 0.0872666 0.0153195 -0.0089968 0.0118383 0.018679 -0.1410215 -0.0109691 -0.0106781 -0.161605 -0.0835153 0.0406271 0.0023026 -0.0039212 -0.0978479 -0.0806016 -0.1070926 -0.0481641 0.1026459 0.1009723 -0.0173589 -0.0161132 0.0494799 -0.1372667 0.2186392 0.38226 -0.0644509 0.733036 0.7935482 -0.1463174 -0.0565132 -0.0769488 -0.063949 -0.2092483 0.163612 0.0042493 -0.2148566 0.0564576 0.0628407 0.0000284 -0.0420873 -0.1786424 1.1596635 -0.3348664 -0.3107823 -0.2580321 -0.1508356 0.061475 -0.3361571 0.0898655 0.1732985 0.0253017 -0.0558742 0.0281137 -0.0580788 -0.0814566 0.1141188 0.0365766 0.0772925 -0.0029478 0.0437986 0.031124 0.0087366 0.0224343 -0.0580411 -0.1301686 0.0211519 -0.0951682 -0.0508682 0.01245 0.010873 0.0264746 0.0438871 -0.051348 -0.1403074 0.0373765 -0.0783287 -0.0351676 0.000142 -0.036598 0.0415475 -0.0682078 -0.088041 0.1238614 0.0323382 0.0636104 0.0074793 0.0309015 -0.0010542 -0.017011 0.0350472 -0.0648976 -0.1473892 0.0199066 -0.1247395 -0.0763353 0.0169275 -0.0223348 0.0120442 -0.0665966 -0.1084172 0.139855 0.0370512 0.1123635 -0.0211476 0.0813546 -0.0808468 0.0359921 -0.0336744 -0.0984505 0.1242762 -0.0088843 0.0975448 0.0056618 0.097153 0.039037 0.0191551 -0.0004485 -0.0672109 -0.1452656 -0.0284301 -0.1090715 -0.0457188 -0.2422531 0.0307508 0.0325884 0.031607 0.0975074 0.0011183 0.0512339 -0.0018689 0.0569642 0.0855346 0.0635243 0.0309568 0.0681954 -0.0093998 -0.0212024 0.0291944 -0.0219518 0.1328646 0.0320407 -0.1046067 0.0404761 -0.0972004 -0.0338781 0.0179048 0.0376117 0.0227373 0.1333971 -0.002724 0.0934527 0.0495628 0.0851303 -0.066854 -0.0300345 0.0568517 -0.0350865 0.1542962 0.4163787 -0.0656522 -0.0057705 -0.0096809 0.0560964 -0.0137038 -0.0087484 0.0056126 0.386163 unknown
polarizability: 162.3772808|6.0061706|126.8057288|-14.392653|-0.8125706|74.5065777 unknown
InChI: InChI=1S/C10H13ClO/c1-2-3-4-8-5-6-10(12)9(11)7-8/h5-7,12H,2-4H2,1H3
charge 0 multiplicity 1
25 atoms
Cl -2.875421 -2.298398 0.260479
O  -3.85241 0.4996 0.669483
C  2.631953 -0.046479 0.236304
C  1.683653 0.182587 -0.973987
C  4.114538 -0.164402 -0.182548
C  0.22114 0.292844 -0.57046
C  5.060525 -0.392283 1.015823
C  -0.562619 -0.875059 -0.37829
C  -0.389189 1.549663 -0.337282
C  -1.902909 -0.780845 0.032549
C  -1.735558 1.643662 0.075589
C  -2.512414 0.474652 0.266538
H  2.322889 -0.966297 0.7730
H  2.51261 0.78815 0.956504
H  1.818844 -0.65292 -1.689324
H  1.998711 1.104543 -1.501215
H  4.223579 -0.998675 -0.905527
H  4.41543 0.756323 -0.723416
H  4.802277 -1.32334 1.554657
H  4.993515 0.441979 1.739349
H  6.11379 -0.4723 0.68971
H  -0.127605 -1.864594 -0.554507
H  0.191641 2.467613 -0.483197
H  -2.190704 2.628109 0.246668
H  -4.159364 1.430766 0.801001
