program: Gaussian 09
title: 000029356
version: EM64L-G09RevD.01
frameworkgroup: C1[X(C13H19ClO)]
method: RPBEPBE
basis: SDD
operation: Freq
keyword: #p
keyword: freq=noraman
keyword: PBEPBE/SDD
title: #p freq=noraman PBEPBE/SDD
converged: YES YES NO NO
title: Mulliken charges:
elementType: Cl O C C C C C C C C C C C C C H H H H H H H H H H H H H H H H H H H
charge: -0.075677 -0.414392 -0.363174 -0.374391 -0.384828 -0.353075 -0.574316 -0.355598 0.541140 -0.695977 -0.415605 -0.401549 -0.280505 -0.322923 0.353261 0.192544 0.191648 0.192106 0.191423 0.210282 0.210197 0.188027 0.188391 0.208273 0.209522 0.195256 0.195528 0.209851 0.209692 0.215898 0.259230 0.238521 0.253462 0.357757
chargesum: 0.00000
title: Mulliken charges with hydrogens summed into heavy atoms:
elementType: Cl O C C C C C C C C C C C C C
charge: -0.075677 -0.056635 0.021019 0.009138 0.035652 0.023344 -0.156521 0.035186 0.541140 -0.060536 -0.156374 -0.163029 -0.280505 -0.069461 0.353261
polarizability: 2.10159028e+02 1.01344046e+01 1.48608957e+02 -1.93988740e+01 5.97236238e+00 1.06607534e+02
1716.lowfreq: -36.7933 -3.7397 -0.0011 0.0008 0.0022 4.9133 10.4481 18.0576 35.7949
frequency: -31.5250 15.2320 35.7681 48.4236 80.4041 90.9367 119.8679 131.5187 144.8124 178.6970 199.3470 223.3317 225.9481 280.3700 288.6616 371.0350 377.2684 394.9530 431.9507 446.8312 462.1436 480.7541 515.9003 593.4912 671.4549 707.1775 718.0972 728.7032 757.6749 764.9307 819.9886 828.2655 861.0849 876.0443 889.5218 904.8543 954.6255 988.9200 990.8704 1020.9979 1027.7005 1040.2292 1073.0991 1079.8840 1080.8287 1117.3545 1130.7817 1172.0096 1186.6572 1205.3433 1219.5507 1227.7370 1252.1708 1265.3910 1267.5906 1279.3259 1288.3639 1290.3647 1305.8333 1309.7522 1334.6264 1350.6415 1354.1695 1388.0731 1389.8778 1412.6363 1459.3065 1459.9606 1464.2449 1469.6570 1476.3722 1477.2362 1484.0355 1486.9905 1487.6685 1581.3137 1619.2776 2949.4546 2950.6000 2957.2617 2966.5636 2968.9476 2971.6389 2979.6777 2984.6454 2993.7319 3008.6528 3020.4656 3034.5564 3048.7679 3068.1139 3070.7591 3132.7046 3151.9150 3171.8841 3501.6027
redmass: 1.7597 4.5330 4.7719 2.7556 1.8589 4.1669 2.1792 1.9375 4.9316 5.8011 4.0081 4.8131 1.1394 4.1059 3.9763 3.8902 5.4871 4.0111 2.5774 1.2068 3.0152 4.1821 4.8710 4.1383 6.9766 3.6903 1.0635 1.0870 1.1857 4.1087 1.2429 1.4417 3.1777 1.8374 1.8325 1.2640 1.3658 3.1848 1.3564 2.9055 3.1801 3.3720 2.5080 1.3491 2.1729 2.5129 1.3410 1.3642 1.7315 1.7084 1.2856 1.4149 2.2278 1.2964 1.4278 1.0407 1.1642 1.0835 1.3603 1.5605 1.4367 1.5640 1.6806 1.2170 4.6162 3.2527 1.0751 1.0732 1.0738 1.0839 1.0469 1.0783 1.0878 1.1453 2.9660 6.2111 7.4800 1.0589 1.0589 1.0591 1.0591 1.0585 1.0367 1.0592 1.0971 1.0997 1.1019 1.1034 1.1046 1.1047 1.1007 1.0992 1.0897 1.0923 1.0953 1.0648
irintensity: 0.0039 0.0583 0.0208 0.0051 0.0035 0.0526 0.0108 0.0100 0.0474 0.3757 0.8647 1.6105 0.0218 0.2776 4.1389 0.1374 1.9023 1.1017 44.8141 109.5456 0.1731 21.6015 7.3680 10.8495 18.0756 6.0125 12.3450 0.0201 3.0347 26.3811 1.8825 31.3694 13.8742 10.7844 10.4911 3.0889 0.2497 1.4010 0.7351 17.0072 1.2358 1.7341 1.2915 1.2830 0.2508 16.6345 12.5441 208.6609 0.0398 20.7721 11.8349 0.4897 27.7433 0.9142 5.1976 0.2088 0.8732 0.1519 3.3008 11.6346 1.2192 0.3433 0.9211 11.0539 16.6544 11.7989 0.0674 0.0366 0.0238 1.0709 10.9291 2.8742 0.4535 27.2909 153.4569 10.0831 9.2053 1.9352 0.4486 22.1195 13.7399 96.2041 36.2552 91.9795 0.4469 0.4922 0.2752 0.4656 41.5434 109.3373 97.3217 54.2750 12.8078 2.9689 4.9054 58.4975
temp: 298.150 k
press: 1.00000 atm
elementType: 17 8 6 6 6 6 6 6 6 6 6 6 6 6 6 1 1 1 1 1 1 1 1 1 1 1 1 1 1 1 1 1 1 1
symmnumber: 1
zpe: 754059.2 jmol-1
zpe.correction: 0.287206 hartree
zpe.thermalcorrener: 0.303313 hartree
zpe.thermalcorrenthalpy: 0.304258 hartree
zpe.thermalcorrgfe: 0.241140 hartree
zpe.sumelectzpe: -1040.909098 hartree
zpe.sumelectthermal: -1040.892991 hartree
zpe.sumelectthermalent: -1040.892046 hartree
zpe.sumelectthermalfe: -1040.955165 hartree
dipole: -1.9481 -0.0606 0.5030
dipole: 2.0129
quadrupole: -104.5035 -96.5248 -101.5611
quadrupole: 3.1708 -0.5605 -0.0390
quadrupole: -3.6404 4.3383 -0.6979 3.1708 -0.5605 -0.0390
hfenergy: -1041.196304 hartree
pointgroup: C01 [X(C13H19Cl1O1)]
dipole: 0.76326 0.0549946 0.20391 debye
polarizability: 208.7946161|12.4761893|150.0358755|20.6412731|-3.5181737|106.5450271 unknown
InChI: InChI=1S/C13H19ClO/c1-2-3-4-5-6-7-11-8-9-13(15)12(14)10-11/h8-10,15H,2-7H2,1H3
charge 0 multiplicity 1
34 atoms
Cl -4.411574 -2.407395 -0.167644
O  -5.315544 0.390702 -1.069658
C  2.506454 0.139109 0.713071
C  3.586485 -0.067057 -0.372884
C  1.069703 0.123752 0.14639
C  5.028123 -0.045234 0.183539
C  -0.015303 0.333476 1.239863
C  6.105196 -0.251545 -0.905984
C  -1.426178 0.338582 0.671883
C  7.543665 -0.225369 -0.345667
C  -2.163634 -0.867626 0.556676
C  -2.023678 1.535891 0.195345
C  -3.443508 -0.849263 -0.018811
C  -3.309301 1.543546 -0.380121
C  -4.043393 0.340286 -0.496743
H  2.606742 -0.651814 1.485884
H  2.686717 1.104187 1.231885
H  3.407684 -1.033673 -0.888678
H  3.481377 0.721277 -1.147418
H  0.964005 0.914483 -0.623711
H  0.882158 -0.839265 -0.370405
H  5.209383 0.921794 0.69809
H  5.136365 -0.833567 0.95782
H  0.186144 1.292691 1.756415
H  0.089025 -0.465314 2.000221
H  5.99428 0.534934 -1.680354
H  5.92367 -1.218614 -1.4181
H  7.691057 -1.023226 0.406659
H  7.759609 0.741949 0.146279
H  8.293252 -0.372502 -1.144916
H  -1.741158 -1.811524 0.916301
H  -1.472685 2.47983 0.280106
H  -3.772661 2.465306 -0.743878
H  -5.717176 -0.518705 -1.084253
