program: Gaussian 09
title: 000029376
version: EM64L-G09RevD.01
frameworkgroup: C1[X(C7H16N2O)]
method: RPBEPBE
basis: SDD
operation: Freq
keyword: #p
keyword: freq=noraman
keyword: PBEPBE/SDD
title: #p freq=noraman PBEPBE/SDD
converged: YES YES NO NO
title: Mulliken charges:
elementType: O N N C C C C C C C H H H H H H H H H H H H H H H H
charge: -0.332060 -0.154432 -0.412026 -0.349136 -0.394537 0.314156 -0.656015 -0.650711 -0.338525 -0.650588 0.199342 0.263057 0.227862 0.205374 0.245880 0.199320 0.212846 0.222678 0.226273 0.214135 0.295709 0.260879 0.203461 0.197114 0.237150 0.212793
chargesum: 0.00000
title: Mulliken charges with hydrogens summed into heavy atoms:
elementType: O N N C C C C C C C
charge: -0.332060 -0.154432 -0.116317 0.113263 0.038699 0.314156 0.002032 0.012375 0.125815 -0.003531
polarizability: 1.14767755e+02 1.33592390e+00 9.53091183e+01 -1.51208622e+00 4.19176897e+00 7.58896046e+01
1716.lowfreq: -11.5572 -1.7924 -0.0005 -0.0004 -0.0003 9.8758 28.1362 47.5986 71.2442
frequency: 27.8882 47.4471 71.2355 74.5098 95.3605 124.4521 186.7554 200.6978 218.4292 271.9117 310.3491 348.4954 353.4822 387.3470 444.7262 462.4686 536.7339 576.8270 707.4977 738.8670 775.1417 784.3431 824.8163 883.3815 932.2640 950.3685 1028.6700 1073.5117 1078.0691 1080.3153 1096.0077 1120.3394 1133.7176 1194.9823 1218.7255 1256.5180 1290.2325 1300.0062 1337.2922 1354.5592 1364.4478 1382.7004 1383.9776 1385.7373 1390.1560 1454.3417 1458.5322 1464.5522 1467.3801 1469.7174 1478.9276 1480.1253 1481.7967 1500.6607 1505.1799 1601.3329 2969.9284 2977.5281 2978.7815 2982.3732 2986.7035 2990.9939 3034.7306 3063.1857 3063.3747 3079.9762 3081.8178 3083.5141 3088.0929 3095.5222 3098.5381 3580.5358
redmass: 2.3982 2.6169 3.3235 3.1506 3.3395 3.4159 1.2865 1.0339 1.1181 1.6878 2.7337 2.7386 2.4466 1.8572 1.7341 2.9744 2.8714 3.3923 10.1177 1.8074 1.1814 1.1543 1.6562 2.1581 2.0965 2.3140 2.8333 2.1010 2.1681 1.9398 1.6716 2.1709 1.7247 2.3190 2.8776 1.5060 1.1564 1.3807 1.3127 1.2758 1.2826 1.2431 1.2312 1.2613 1.4868 1.0910 1.1398 1.0450 1.0446 1.0487 1.0708 1.0553 1.0507 1.8858 1.1150 5.5269 1.0651 1.0360 1.0373 1.0370 1.0655 1.0665 1.0965 1.0981 1.0979 1.0993 1.0964 1.0961 1.1010 1.1015 1.1013 1.0766
irintensity: 0.4891 0.4684 7.2016 2.4203 4.4728 0.2620 0.9897 0.1482 1.9162 1.7347 0.3109 24.7416 2.5251 26.9517 85.9970 8.3205 1.9786 0.9645 14.8902 7.6629 9.3725 4.9055 8.7319 7.3883 7.9740 0.3749 22.4353 8.7912 14.4539 17.2977 17.5351 0.8574 3.1848 78.6699 22.6556 142.9976 58.7727 30.9832 15.7691 5.7788 8.5962 3.0130 23.4727 28.1619 48.4990 28.1693 47.9649 6.9240 9.7409 17.6349 4.6700 16.7549 5.2441 332.2175 29.4030 251.7707 41.8381 33.0799 38.0746 19.3838 49.2298 58.5869 15.3252 8.8716 30.9656 40.0316 40.7363 37.6160 34.1070 32.6389 31.2352 5.2578
temp: 298.150 k
press: 1.00000 atm
elementType: 8 7 7 6 6 6 6 6 6 6 1 1 1 1 1 1 1 1 1 1 1 1 1 1 1 1
symmnumber: 1
zpe: 600070.2 jmol-1
zpe.correction: 0.228555 hartree
zpe.thermalcorrener: 0.241559 hartree
zpe.thermalcorrenthalpy: 0.242503 hartree
zpe.thermalcorrgfe: 0.188098 hartree
zpe.sumelectzpe: -460.253193 hartree
zpe.sumelectthermal: -460.240189 hartree
zpe.sumelectthermalent: -460.239245 hartree
zpe.sumelectthermalfe: -460.293650 hartree
dipole: -0.8881 3.7228 2.0007
dipole: 4.3186
quadrupole: -55.1869 -64.6020 -65.4654
quadrupole: 2.1612 0.7480 -1.3668
quadrupole: 6.5645 -2.8506 -3.7140 2.1612 0.7480 -1.3668
hfenergy: -460.4817477 hartree
pointgroup: C01 [X(C7H16N2O1)]
dipole: -0.4730054 -1.2456417 -1.0542776 debye
dipolederiv: -0.7930753 -0.0835581 -0.1129802 -0.0758751 -0.8217872 -0.3613007 -0.1261778 -0.35963 -0.6780201 -1.3724902 -0.0433153 -0.1869994 -0.0515212 -0.7140225 -0.0553172 -0.2231141 -0.1304929 -0.4477094 -1.2675435 0.2194278 0.2033826 0.3977926 -0.5739536 0.016156 0.2856979 0.0562839 -0.485155 0.4706219 -0.2414054 -0.076557 -0.3112021 0.4441663 -0.0493734 -0.1981316 -0.0429025 0.1602811 0.1762998 0.1400887 0.0015689 0.206958 0.5628247 0.0872609 0.1048097 0.1139917 0.3311822 2.1637636 -0.0531133 0.179998 -0.2717405 0.943601 0.5548217 0.0926926 0.5137575 0.6936345 -0.0110657 0.0505261 0.0018055 0.0761553 -0.0756752 0.0876615 -0.0036459 0.1256296 0.0179942 0.0482996 -0.0267631 0.01659 -0.0552849 -0.1376417 0.041146 -0.0109697 0.0912256 0.0025106 0.7854884 -0.0107868 -0.0689085 0.1351031 0.2144465 -0.1220525 0.0931768 -0.1623967 0.1875514 -0.082391 -0.0148377 0.0604582 -0.0536371 0.0313667 0.0863754 0.0770935 0.1056177 -0.0208731 -0.1494101 -0.0604238 0.0654738 -0.0909746 -0.0702098 0.0808034 0.0337204 0.049403 0.0766812 0.1346099 -0.017007 -0.0810562 0.0505032 0.0266399 -0.0415116 -0.0057279 -0.0322867 -0.0371505 -0.1047187 0.0242637 -0.1238891 0.0331379 0.0145195 0.0488311 -0.087006 0.0245816 0.0380689 -0.0230222 0.0080815 0.1767282 -0.0253041 -0.028333 -0.0281826 0.1020238 -0.0242945 -0.0722222 -0.0235651 -0.1326486 0.0363367 -0.0842635 0.0108772 0.0397512 0.0172399 0.0232489 0.0737762 0.0713781 -0.0228848 -0.0680835 -0.051374 0.0364498 -0.1049277 -0.0832213 -0.050411 -0.1284504 -0.0898397 0.1440984 0.0673188 0.1510824 -0.014411 -0.0373577 0.0799069 -0.0567207 0.0449432 -0.0817699 0.0942321 -0.0900943 0.0465666 0.069603 0.0310433 -0.0708033 0.0398184 0.0441403 -0.0302648 -0.0118485 0.1185106 0.0423041 0.0845251 -0.0187737 0.1224286 0.0209523 -0.0242267 0.0709497 -0.0666394 -0.0477223 -0.0872124 -0.09307 -0.1139333 -0.0598175 -0.1381718 -0.0311675 0.1475743 0.0133383 -0.0211776 -0.0004091 0.165485 -0.120471 -0.0672488 -0.1495484 0.1953052 0.1123333 -0.004864 0.0385653 -0.0945252 0.0667387 -0.0693225 -0.0320838 -0.0356986 -0.0138342 -0.0950744 0.0663916 -0.0111205 0.1125896 -0.1329124 0.1147863 -0.0107567 0.0771354 0.0591264 0.0958279 -0.0323724 -0.0202904 -0.006598 -0.0227819 -0.1411682 0.0256473 -0.096871 -0.1052235 0.0763034 0.0988509 -0.0274435 0.0627308 -0.0888645 0.0713499 -0.0060223 0.0471394 0.055164 -0.2292194 -0.0368309 -0.030414 -0.0550019 0.1024192 0.0037053 -0.0497106 -0.0093601 0.0636733 unknown
polarizability: 114.4862525|-2.9776689|93.2015956|0.7146249|7.6825796|78.2786302 unknown
InChI: InChI=1S/C7H16N2O/c1-4-8-7(10)9(5-2)6-3/h8H,4-6H2,1-3H3
charge 0 multiplicity 1
26 atoms
O  0.571023 1.215805 1.384204
N  -1.039091 -0.001675 0.195161
N  1.26158 -0.614046 0.107807
C  -2.108355 0.86368 0.740807
C  -1.426652 -1.083376 -0.729065
C  0.279229 0.250884 0.60228
C  -2.502818 2.011377 -0.213901
C  -1.603637 -2.459764 -0.04168
C  2.685304 -0.389144 0.402321
C  3.460757 0.231881 -0.78052
H  -2.988167 0.229747 0.968601
H  -1.734451 1.285179 1.688417
H  -2.381201 -0.789568 -1.203556
H  -0.696375 -1.156575 -1.560657
H  -1.638405 2.676305 -0.381433
H  -2.845231 1.628573 -1.193821
H  -3.323498 2.610713 0.22272
H  -0.668201 -2.793565 0.442058
H  -2.381247 -2.40261 0.740571
H  -1.91001 -3.22776 -0.77641
H  1.014825 -1.383789 -0.511746
H  2.717607 0.289005 1.271534
H  3.148557 -1.349837 0.701561
H  3.425668 -0.41739 -1.675657
H  3.030827 1.213409 -1.045776
H  4.522763 0.380441 -0.509216
