program: Gaussian 09
title: 000029378
version: EM64L-G09RevD.01
frameworkgroup: C1[X(C18H20N2)]
method: RPBEPBE
basis: SDD
operation: Freq
keyword: #pfreq=noraman
keyword: PBEPBE/SDD
title: #p freq=noraman PBEPBE/SDD
converged: YES YES NO NO
title: Mulliken charges:
elementType: N N C C C C C C C C C C C C C C C C C C H H H H H H H H H H H H H H H H H H H H
charge: -0.103997 -0.174861 -0.263765 -0.400568 -0.332027 0.225802 0.347059 -0.588049 0.306082 -0.410882 0.218999 -0.377679 -0.367177 -0.435737 -0.353211 -0.683452 -0.261745 -0.242771 -0.273541 -0.257035 0.211795 0.191249 0.216742 0.202487 0.183239 0.210665 0.234231 0.200904 0.228238 0.251754 0.251471 0.235846 0.238595 0.231072 0.241900 0.203020 0.226581 0.224750 0.223632 0.220383
chargesum: 0.00000
title: Mulliken charges with hydrogens summed into heavy atoms:
elementType: N N C C C C C C C C C C C C C C C C C C
charge: -0.103997 -0.174861 -0.051970 0.007423 0.053699 0.225802 0.347059 -0.143152 0.306082 0.018260 0.218999 -0.125925 -0.115706 -0.199891 -0.114616 -0.007460 -0.035164 -0.018021 -0.049908 -0.036652
polarizability: 2.48432413e+02 -6.37294659e+00 2.08110004e+02 1.15033902e+01 7.92997913e-01 1.44845198e+02
1716.lowfreq: -9.1350 -1.3372 -0.0007 -0.0007 -0.0005 6.6860 46.2855 58.6468 86.1890
frequency: 46.1634 58.6023 86.1698 118.6510 128.2820 142.8799 173.0341 234.3919 249.8336 259.4548 269.9398 302.1460 323.9228 332.5115 354.1934 377.8232 403.8766 441.5889 453.8975 483.9897 492.4378 508.7641 531.9186 545.9243 564.9013 583.9963 619.1733 647.8699 701.9242 729.4435 731.8903 756.9973 763.0883 780.4531 793.1079 827.8672 843.1540 861.4257 877.4242 892.6561 926.3876 942.8524 946.2401 952.0710 974.0002 982.7015 986.3859 1027.1866 1039.4327 1047.6221 1059.2502 1069.4112 1080.0702 1109.6800 1111.8498 1117.5081 1136.0875 1147.6754 1171.4455 1173.4914 1176.0892 1186.3447 1195.5486 1203.7348 1220.0989 1238.2630 1253.9244 1254.7029 1268.9089 1291.9848 1302.9965 1326.0659 1334.6049 1348.1083 1355.0315 1375.2171 1378.7872 1384.3705 1392.5284 1432.5116 1438.8401 1441.8758 1448.0568 1455.5957 1457.5870 1474.0459 1480.4882 1488.1278 1489.9753 1494.1449 1579.9455 1593.4336 1607.7152 1614.6296 2839.0166 2842.4241 2855.8795 2896.6659 2953.7240 2982.4000 3012.0989 3016.6400 3029.7039 3040.3548 3047.3397 3087.1449 3114.2213 3120.7228 3121.2880 3135.0746 3137.5859 3149.7051 3159.0261 3162.1453
redmass: 3.7657 3.9579 4.2439 3.4478 3.7702 3.0911 2.9898 3.2125 3.6053 1.2192 2.7291 3.0852 2.6751 3.1306 3.3159 3.1144 3.7426 2.7807 4.0505 3.1786 3.9323 3.7885 3.1313 3.2333 3.1402 3.4205 4.4683 5.7346 3.2947 3.2253 3.9630 1.3133 1.5662 4.0244 2.4295 2.7562 2.4802 1.6968 1.4502 3.2365 2.4346 1.6109 2.1623 1.4273 1.3231 2.3053 1.3313 2.4312 2.1350 2.2352 2.1355 2.3964 2.4011 1.7199 1.5712 2.1917 2.7042 1.8494 1.4130 1.0861 1.3722 1.8672 1.4748 2.1435 1.8351 1.4484 1.3307 1.7685 1.6869 1.5358 1.4926 1.5777 1.4629 1.3069 1.6132 1.3928 6.1358 2.6592 1.8828 1.4991 1.5709 1.8679 1.2366 1.1726 1.1811 1.0511 1.1920 1.7362 1.6348 1.5067 6.8139 6.9975 6.1743 6.4620 1.0759 1.0742 1.0710 1.0534 1.0643 1.0618 1.0891 1.0876 1.0780 1.0971 1.0999 1.1006 1.0862 1.0887 1.0848 1.0892 1.0934 1.0933 1.1005 1.0998
irintensity: 0.2857 0.3208 0.3085 0.4895 4.1805 0.2055 1.0982 0.5966 5.2965 0.1465 5.3069 1.3702 1.2528 0.9790 1.7293 1.8683 1.3301 1.8204 1.8371 0.1995 4.6397 5.4543 1.2190 7.9747 5.8126 0.4277 12.9232 2.9816 12.9110 22.8692 1.1481 55.7762 71.8638 3.5891 0.9874 1.5325 6.2024 1.4851 0.0970 11.8552 16.2548 0.9081 0.8367 1.7474 0.3783 5.1562 0.1296 7.2990 2.3162 17.9282 2.4473 20.9442 3.5554 3.2849 20.8242 25.9634 53.1940 26.4174 1.0147 2.3558 0.8660 18.0959 1.6816 0.9044 2.9620 10.6884 18.8751 11.9996 11.9906 13.0544 7.0751 22.8111 43.6455 11.2187 5.9849 4.8418 0.1286 1.4682 0.1767 14.5657 6.5233 8.6105 17.1854 18.7752 10.6913 26.3203 2.6017 30.1016 12.2734 54.9381 4.3841 1.5391 42.4168 4.2899 36.0304 25.5864 190.7381 125.8476 59.7971 19.8032 1.7646 118.3790 32.2813 43.8807 36.2340 27.6371 10.1368 3.6108 2.3976 12.1871 30.1266 31.1664 33.8479 26.3235
temp: 298.150 k
press: 1.00000 atm
elementType: 7 7 6 6 6 6 6 6 6 6 6 6 6 6 6 6 6 6 6 6 1 1 1 1 1 1 1 1 1 1 1 1 1 1 1 1 1 1 1 1
symmnumber: 1
zpe: 885144.3 jmol-1
zpe.correction: 0.337134 hartree
zpe.thermalcorrener: 0.353300 hartree
zpe.thermalcorrenthalpy: 0.354244 hartree
zpe.thermalcorrgfe: 0.294363 hartree
zpe.sumelectzpe: -805.955151 hartree
zpe.sumelectthermal: -805.938985 hartree
zpe.sumelectthermalent: -805.938041 hartree
zpe.sumelectthermalfe: -805.997922 hartree
dipole: 0.8957 -1.6761 0.5520
dipole: 1.9789
quadrupole: -104.3934 -110.8397 -119.8671
quadrupole: -2.8382 4.9791 1.3986
quadrupole: 7.3066 0.8604 -8.1670 -2.8382 4.9791 1.3986
hfenergy: -806.2922848 hartree
pointgroup: C01 [X(C18H20N2)]
dipole: 0.3256769 0.6692387 -0.2285577 debye
polarizability: 247.0059282|7.5051931|208.4846745|-15.4776566|0.3268626|145.8970122 unknown
InChI: InChI=1S/C18H20N2/c1-19-12-13-20-11-10-14-6-2-3-7-15(14)18(20)16-8-4-5-9-17(16)19/h2-9,18H,10-13H2,1H3
charge 0 multiplicity 1
40 atoms
N  -0.029366 1.802888 0.445982
N  2.672344 0.84364 -0.809268
C  -0.157424 0.519431 -0.335002
C  -1.292031 2.531408 0.707891
C  1.003878 2.673533 -0.145168
C  -1.582986 -0.03594 -0.384863
C  0.86234 -0.526187 0.160087
C  -2.301174 1.598334 1.398089
C  -2.611315 0.439132 0.469556
C  2.426764 2.094277 -0.035497
C  2.244084 -0.368567 -0.18352
C  -1.878099 -1.065822 -1.31398
C  0.467021 -1.6795 0.874423
C  -3.905937 -0.131842 0.390463
C  3.159425 -1.415388 0.115624
C  3.95262 0.822596 -1.538091
C  -3.166586 -1.633669 -1.38687
C  -4.188108 -1.168398 -0.524313
C  1.387802 -2.69915 1.205456
C  2.734012 -2.574511 0.798016
H  0.142905 0.735937 -1.392629
H  -1.756935 2.945298 -0.223736
H  -1.048754 3.387776 1.365381
H  0.998637 3.635603 0.404319
H  0.792017 2.899184 -1.222368
H  -3.225155 2.14958 1.653155
H  -1.851031 1.238743 2.344447
H  3.125378 2.861171 -0.419729
H  2.658546 1.933219 1.03866
H  -1.082737 -1.430444 -1.975158
H  -0.587585 -1.800383 1.143932
H  -4.696958 0.248642 1.048657
H  4.214033 -1.313007 -0.159029
H  4.01372 1.714437 -2.186426
H  3.999543 -0.069771 -2.185414
H  4.850718 0.819129 -0.876529
H  -3.375261 -2.429256 -2.110689
H  -5.193626 -1.601173 -0.574998
H  1.052535 -3.585704 1.754445
H  3.456744 -3.367047 1.024896
