program: Gaussian 09
title: 000029372
version: EM64L-G09RevD.01
frameworkgroup: C1[X(C6H14N2S2)]
method: RPBEPBE
basis: SDD
operation: Freq
keyword: #p
keyword: freq=noraman
keyword: PBEPBE/SDD
title: #p freq=noraman PBEPBE/SDD
converged: YES YES NO NO
title: Mulliken charges:
elementType: S S N N C C C C C C H H H H H H H H H H H H H H
charge: 0.001062 0.023952 -0.083059 0.064175 -0.319766 -0.437434 -0.616013 -0.614999 -0.615644 -0.535252 0.192939 0.241882 0.267557 0.234544 0.235156 0.191830 0.224459 0.217031 0.230920 0.192982 0.265924 0.215304 0.263715 0.158736
chargesum: 0.00000
title: Mulliken charges with hydrogens summed into heavy atoms:
elementType: S S N N C C C C C C
charge: 0.159798 0.023952 -0.083059 0.064175 0.115055 0.064667 0.035432 0.025933 0.129298 -0.535252
polarizability: 1.51588394e+02 -1.30974393e+00 1.16154072e+02 1.35007822e+01 -3.76689046e+00 7.51584425e+01
1716.lowfreq: -14.2527 -6.8681 -0.0039 -0.0030 -0.0021 10.6890 27.3945 40.1401 47.7381
frequency: 25.4171 40.1235 47.5897 92.9370 114.6587 143.0006 193.4596 214.4761 225.8490 258.9877 283.7818 300.0731 308.6964 346.4450 388.6025 412.6650 432.3795 459.7368 544.4083 597.0130 784.4317 804.6636 831.2298 882.8053 974.6054 1018.3890 1036.7878 1040.4215 1059.4276 1087.3652 1101.7543 1113.0434 1139.0882 1175.3958 1224.6115 1263.7350 1273.2290 1297.0222 1320.8610 1370.8257 1396.3927 1420.9167 1442.2424 1445.7881 1455.9372 1462.4369 1468.3251 1473.0988 1475.6795 1482.0220 1486.3382 1506.5231 2466.4379 2853.8224 2856.6120 2874.1514 2988.6263 3016.8146 3022.7858 3025.3324 3045.2966 3074.2912 3078.1070 3083.4537 3085.6193 3111.0675
redmass: 2.9165 4.2781 4.9265 1.9125 1.3169 2.8186 2.1779 1.0756 1.4029 4.3929 4.1102 1.2038 3.4263 2.6005 3.9812 2.8619 2.6974 2.9042 8.0534 4.5715 1.1698 2.2990 2.2311 3.0190 3.4370 2.7570 1.5476 1.9055 2.4475 1.2666 1.6008 1.3095 1.5182 1.8600 3.1804 2.1234 2.1619 1.2027 1.3288 1.3597 1.8627 1.1397 1.1307 1.0636 1.2501 1.0796 1.0752 1.0612 1.0539 1.0997 1.0550 1.3321 1.0376 1.0593 1.0635 1.0606 1.0331 1.0625 1.0735 1.0720 1.0879 1.1010 1.1011 1.1007 1.1034 1.1019
irintensity: 0.5891 0.2445 0.4589 0.9079 0.4998 0.9854 1.1379 0.6317 1.0269 1.5417 3.7292 34.6996 9.5331 15.6921 10.6547 6.4784 0.8558 10.0647 1.5829 10.0627 11.5460 29.4052 6.0015 60.3299 79.2981 8.7095 25.7209 13.4992 36.7323 5.2384 59.9717 0.6836 1.2856 22.1826 17.5844 13.7202 46.3504 15.6619 0.3767 3.3461 124.9838 2.7007 6.1929 13.0508 46.8422 6.6403 4.0827 18.4789 15.7416 31.2656 3.1314 128.0844 4.1422 66.7196 75.7164 205.4667 29.7267 9.6900 33.2647 62.1690 6.3435 14.9829 18.9538 51.5395 22.6580 22.3309
temp: 298.150 k
press: 1.00000 atm
elementType: 16 16 7 7 6 6 6 6 6 6 1 1 1 1 1 1 1 1 1 1 1 1 1 1
symmnumber: 1
zpe: 516356.8 jmol-1
zpe.correction: 0.196670 hartree
zpe.thermalcorrener: 0.210155 hartree
zpe.thermalcorrenthalpy: 0.211099 hartree
zpe.thermalcorrgfe: 0.154889 hartree
zpe.sumelectzpe: -1141.804252 hartree
zpe.sumelectthermal: -1141.790768 hartree
zpe.sumelectthermalent: -1141.789823 hartree
zpe.sumelectthermalfe: -1141.846034 hartree
dipole: -4.3202 -1.4416 -0.0356
dipole: 4.5545
quadrupole: -84.2325 -71.3362 -79.7549
quadrupole: 3.9640 -3.3245 2.2946
quadrupole: -5.7913 7.1050 -1.3137 3.9640 -3.3245 2.2946
hfenergy: -1142.0009224 hartree
pointgroup: C01 [X(C6H14N2S2)]
dipole: -1.6662887 0.6554383 0.0685139 debye
dipolederiv: -0.0304229 -0.2914865 0.00704 -0.2245951 -0.7273572 0.1536238 -0.019927 0.1690396 -0.1561007 -0.9013496 -0.1379968 0.2065187 -0.1403205 -0.4095941 0.0695017 0.2727043 0.0703687 -0.2790619 -0.7833845 0.010721 -0.0867258 -0.0761137 -0.5119194 0.0090821 -0.0274985 0.0392486 -0.5254783 -1.1508754 0.2438278 0.1623776 0.4320038 -0.7853782 -0.0689455 0.2398307 -0.0597389 -0.26175 0.5858897 0.0534577 -0.0434261 0.0777409 0.2166316 -0.1646483 0.0546832 -0.2188361 0.1762516 0.4927358 -0.0021518 -0.0345443 0.0851546 0.0939192 0.0287367 -0.1713584 0.069525 0.2145594 0.2325987 0.1271592 0.1702944 0.2034259 0.2555857 0.0228989 0.2439284 0.0021259 0.4050501 0.1885328 -0.188928 -0.0057728 -0.2551456 0.3810024 -0.0738038 -0.0190989 -0.0666486 0.2957329 0.1553806 0.0618059 0.0187702 -0.0552037 0.371403 0.0272138 0.0323557 -0.0331881 0.1732178 1.4352526 0.0161417 -0.4923364 -0.2162095 1.2358687 -0.1399504 -0.5488873 -0.1444447 0.0075374 -0.065443 -0.010094 -0.0182079 -0.1001658 -0.1218714 0.1739923 0.050699 0.128631 -0.0742671 0.0541725 0.029691 0.0282267 0.032423 -0.0395117 -0.0933889 0.0548348 -0.0543369 0.0141155 0.0378944 0.0078311 -0.0152788 0.0024247 -0.0276669 0.0956981 -0.035588 0.0516581 0.0489311 0.002036 0.0388576 0.0486079 0.0588908 -0.0444967 -0.1330226 0.0455892 -0.0800128 0.0090898 0.0562722 0.1366433 0.0197034 0.082745 -0.0896558 -0.0555782 -0.0145646 -0.0586998 0.060215 -0.0039005 -0.0455113 -0.0845149 0.032147 -0.0210877 0.1504511 -0.2018301 0.0092197 -0.245122 -0.1650477 -0.0915948 0.0605286 -0.0450327 0.0958066 0.0120489 0.1070917 0.0308596 0.0165197 0.0487539 -0.0952803 -0.1319441 -0.0566677 -0.0233689 -0.092201 -0.1161614 -0.0853748 -0.024949 -0.154252 0.0048068 0.1185486 -0.068231 0.0688996 0.0451567 0.0889688 0.0317607 0.0571508 0.0130373 0.0732277 0.0085382 0.1428678 -0.135029 0.0638713 -0.1081719 0.2133896 -0.1297843 -0.0044591 -0.1124017 -0.093474 0.0045411 0.0268471 -0.0134253 -0.0715995 -0.0288045 0.0217858 -0.0763724 0.1539806 0.0490806 0.0859515 0.0289145 -0.0083145 0.0608808 -0.0365037 0.0938181 0.0869391 -0.0492682 0.0426594 0.0241687 0.0340163 -0.0202712 0.00596 0.065591 -0.0725522 -0.0539886 0.0665621 0.0653306 -0.0267993 0.1280422 0.0112744 0.0771588 -0.0148286 0.1750902 unknown
polarizability: 150.9575315|-0.2726283|116.2399813|-15.4374722|-2.03221|75.7033959 unknown
InChI: InChI=1S/C6H14N2S2/c1-7(2)4-5-8(3)6(9)10/h9H,4-5H2,1-3H3
charge 0 multiplicity 1
24 atoms
S  1.656993 -2.089022 0.317179
S  3.738054 0.026568 -0.629457
N  -2.513137 -0.199022 0.079813
N  1.214047 0.599019 0.239239
C  -1.153306 0.055435 -0.438755
C  -0.148939 0.265058 0.724669
C  -3.327387 -1.061089 -0.801367
C  -3.229833 1.029554 0.475178
C  1.510601 2.022583 -0.042876
C  2.180988 -0.332181 -0.029806
H  -1.118019 0.938195 -1.126798
H  -0.824589 -0.822995 -1.022167
H  -0.119636 -0.647512 1.343508
H  -0.482789 1.086892 1.382641
H  -2.791653 -2.006385 -0.996068
H  -3.5733 -0.589928 -1.78623
H  -4.279173 -1.30799 -0.297232
H  -2.639426 1.605063 1.20977
H  -4.186659 0.760975 0.957048
H  -3.454957 1.70324 -0.390792
H  2.361533 2.365286 0.572103
H  0.615445 2.622559 0.186413
H  1.792845 2.158166 -1.101809
H  2.893597 -2.58977 -0.037102
