program: Gaussian 09
title: 000029388
version: EM64L-G09RevD.01
frameworkgroup: C1[X(C11H11I3N2O4)]
method: RPBEPBE
basis: SDD
operation: Freq
keyword: #p
keyword: freq=noraman
keyword: PBEPBE/SDD
title: #p freq=noraman PBEPBE/SDD
converged: YES YES NO NO
title: Mulliken charges:
elementType: I I I O O O O N N C C C C C C C C C C C H H H H H H H H H H H
charge: 0.080648 0.149897 0.112655 -0.415075 -0.416779 -0.228141 -0.223288 -0.078923 -0.683087 -0.551974 0.632480 -0.424507 -0.435571 -0.752562 -0.563987 0.854988 -0.095314 -0.601305 0.195704 0.197695 0.303963 0.214875 0.293209 0.238894 0.307185 0.226319 0.271123 0.312723 0.313469 0.382946 0.381742
chargesum: 0.00000
title: Mulliken charges with hydrogens summed into heavy atoms:
elementType: I I I O O O O N N C C C C C C C C C C C
charge: 0.080648 0.149897 0.112655 -0.032129 -0.035037 -0.228141 -0.223288 -0.078923 -0.056895 -0.033137 0.632480 0.107596 0.097933 -0.752562 -0.563987 0.854988 0.175808 -0.601305 0.195704 0.197695
polarizability: 3.00582825e+02 -9.29604592e+00 2.54017900e+02 -2.05653063e+01 -1.27234214e+00 1.24668509e+02
1716.lowfreq: -5.4683 -3.1157 -0.0003 -0.0002 -0.0001 4.6329 18.1147 20.3983 23.0390
frequency: 18.1024 20.3792 22.9979 36.4024 44.3810 53.8135 54.9906 68.4119 88.0747 100.3168 102.3149 121.2220 140.5745 158.6042 188.5961 221.6362 264.6838 273.3157 284.0313 287.0258 309.8640 316.5647 335.4629 396.5910 426.1812 439.3281 477.0374 483.6813 494.8524 498.7552 503.7411 541.5781 586.3290 594.9781 610.1646 620.6196 632.3799 647.0514 688.6925 745.8206 781.2812 817.2204 868.8744 880.6282 893.9913 946.9839 979.7263 983.5857 993.2697 1003.3030 1029.1726 1047.1043 1071.6458 1139.6852 1176.6737 1207.3771 1236.8413 1242.9992 1257.2913 1264.3283 1275.3071 1281.2849 1346.4094 1370.2293 1376.3418 1386.7955 1397.6195 1428.2825 1441.0472 1445.9302 1490.0216 1517.4197 1565.3562 1627.3846 1674.4734 1680.5058 2839.3289 2850.1246 2914.4790 3032.6945 3052.8932 3067.3759 3179.9382 3514.1056 3517.1962 3520.5458 3655.5399
redmass: 14.9047 10.0881 13.3403 10.5243 13.3808 5.2985 10.4035 5.8572 40.7970 11.3833 7.1719 9.3937 5.1992 113.3426 3.6038 4.4683 7.6908 6.2357 4.3287 5.2527 6.5553 3.5931 5.3851 2.8537 1.7563 1.6506 1.2706 3.1118 2.5326 2.3012 2.9267 3.3058 4.8515 4.9088 8.6265 1.7354 1.5844 2.9895 9.0734 7.5587 7.0818 4.9238 4.1468 1.3904 4.1482 2.4112 2.4281 2.3140 2.6646 4.6557 2.4990 2.3826 1.9837 2.7301 2.1423 2.2614 1.2986 1.3290 1.2551 1.7119 1.7739 2.6327 4.2608 2.4229 1.9312 1.6406 1.5702 1.0903 4.3570 1.1305 1.0866 7.7231 4.4463 1.3513 8.2433 8.3913 1.0709 1.0703 1.0688 1.0895 1.0847 1.0840 1.0930 1.0456 1.0641 1.0641 1.1037
irintensity: 0.1429 0.2683 0.7389 0.4055 0.4838 0.4302 0.1182 0.4920 0.0805 1.4827 1.7279 1.3971 0.6325 0.0165 6.6223 1.9755 3.0171 3.3124 5.3501 1.7154 6.9183 7.6904 1.3252 1.7270 5.2652 11.3594 242.8561 27.2710 18.4967 48.2639 8.3856 2.0073 10.7119 24.2403 50.7735 59.8809 158.6420 35.6298 25.4009 35.6858 22.0140 11.9344 0.2530 9.7780 6.4781 33.1466 78.2706 21.8470 29.2824 8.3210 580.2130 189.5599 29.9602 40.1934 10.3399 20.9823 3.7087 20.4178 7.2760 17.3341 7.3566 3.3913 32.8900 23.1330 19.2245 14.1926 21.0705 24.6328 207.2255 3.1306 13.3679 29.0165 0.1196 266.3059 179.5934 234.3662 71.2887 69.1758 53.1008 13.5979 14.6985 9.1060 0.0147 61.9526 29.6819 35.4320 63.6281
temp: 298.150 k
press: 1.00000 atm
elementType: 53 53 53 8 8 8 8 7 7 6 6 6 6 6 6 6 6 6 6 6 1 1 1 1 1 1 1 1 1 1 1
symmnumber: 1
zpe: 551300.0 jmol-1
zpe.correction: 0.209979 hartree
zpe.thermalcorrener: 0.232141 hartree
zpe.thermalcorrenthalpy: 0.233086 hartree
zpe.thermalcorrgfe: 0.151659 hartree
zpe.sumelectzpe: -869.191832 hartree
zpe.sumelectthermal: -869.169670 hartree
zpe.sumelectthermalent: -869.168726 hartree
zpe.sumelectthermalfe: -869.250152 hartree
dipole: -1.4463 3.7194 0.8018
dipole: 4.0704
quadrupole: -146.3743 -154.4910 -156.4946
quadrupole: 1.5317 -4.8433 -0.2641
quadrupole: 6.0790 -2.0377 -4.0413 1.5317 -4.8433 -0.2641
hfenergy: -869.4018112 hartree
pointgroup: C01 [X(C11H11I3N2O4)]
dipole: 0.5931261 -0.2380029 1.4683731 debye
polarizability: 287.2702035|44.1358163|162.605276|29.0746014|-46.1874115|229.3937549 unknown
InChI: InChI=1S/C11H11I3N2O4/c12-6-1-7(13)11(15)10(14)5(6)2-16(3-8(17)18)4-9(19)20/h1,17,19H,2-4,15H2
charge 0 multiplicity 1
31 atoms
I  1.489533 -1.901964 2.509011
I  -0.119087 0.595698 -3.022375
I  5.392454 1.629832 -0.732091
O  -1.708609 2.824976 2.17544
O  -4.674722 -2.167891 -0.647756
O  -3.270767 2.065462 0.63557
O  -2.825457 -1.860795 -2.015509
N  -1.576344 -0.272366 0.153547
N  4.165934 -0.309014 1.63914
C  -0.463155 -1.21566 -0.177042
C  0.899308 -0.546161 -0.26967
C  -1.292674 0.662431 1.251058
C  -2.871377 -0.951781 0.318507
C  1.90106 -0.712037 0.727522
C  1.24445 0.258823 -1.394221
C  3.209865 -0.124896 0.659769
C  2.513293 0.86722 -1.502021
C  3.471505 0.675926 -0.496748
C  -2.211991 1.879049 1.26973
C  -3.386403 -1.675417 -0.91698
H  -0.711766 -1.654132 -1.160173
H  -0.412192 -2.049255 0.559795
H  -0.262484 1.042195 1.14912
H  -1.347428 0.202979 2.271957
H  -3.636686 -0.19806 0.572497
H  -2.867114 -1.704774 1.150012
H  2.752431 1.481239 -2.372528
H  3.969681 -0.883441 2.456145
H  5.080864 0.127776 1.544349
H  -2.321105 3.609222 2.206048
H  -5.017018 -2.640384 -1.454204
