program: Gaussian 09
title: 000029349
version: EM64L-G09RevD.01
frameworkgroup: C1[X(C4H4N2S)]
method: RPBEPBE
basis: SDD
operation: Freq
keyword: #pfreq=noraman
keyword: PBEPBE/SDD
title: #p freq=noraman PBEPBE/SDD
converged: YES YES NO NO
title: Mulliken charges:
elementType: S N N C C C C H H H H
charge: 0.138663 0.213463 0.000394 -0.381004 -0.410259 -0.120623 -0.471675 0.254880 0.251154 0.270302 0.254704
chargesum: 0.00000
title: Mulliken charges with hydrogens summed into heavy atoms:
elementType: S N N C C C C
charge: 0.138663 0.213463 0.000394 0.125031 0.114747 -0.120623 -0.471675
polarizability: 1.04431640e+02 1.40659177e+01 6.08941608e+01 3.51791657e+00 -1.74931781e+00 3.77507493e+01
1716.lowfreq: -7.8370 -4.6256 0.0015 0.0023 0.0029 3.2126 24.9847 38.7711 109.1593
frequency: 24.8884 38.7343 109.1580 196.2063 333.0927 372.0386 395.5903 401.7215 551.1481 623.2895 811.7348 901.9547 1008.1697 1035.4278 1133.7347 1210.0515 1250.3736 1327.0812 1356.8412 1441.5487 1467.6315 2191.0285 2208.1546 2976.3225 3010.1721 3031.8045 3073.3552
redmass: 12.4286 5.1606 5.9315 2.9506 6.2498 2.8703 12.4329 12.0201 4.1856 4.3182 2.7561 2.4572 2.5598 2.1675 5.1481 1.1435 1.1389 1.2974 1.2973 1.0873 1.0786 12.1949 12.4327 1.0577 1.0624 1.1015 1.1014
irintensity: 3.6229 6.2539 2.9802 1.9680 13.8989 1.1647 0.2398 8.5004 21.1398 8.5365 2.5599 8.4970 3.1554 2.2168 1.0676 1.0657 5.6043 19.3057 68.5454 18.2476 32.6626 972.0791 16.6838 47.9891 8.0992 15.0016 7.6570
temp: 298.150 k
press: 1.00000 atm
elementType: 16 7 7 6 6 6 6 1 1 1 1
symmnumber: 1
zpe: 194281.0 jmol-1
zpe.correction: 0.073998 hartree
zpe.thermalcorrener: 0.081817 hartree
zpe.thermalcorrenthalpy: 0.082761 hartree
zpe.thermalcorrgfe: 0.039087 hartree
zpe.sumelectzpe: -661.852006 hartree
zpe.sumelectthermal: -661.844187 hartree
zpe.sumelectthermalent: -661.843243 hartree
zpe.sumelectthermalfe: -661.886917 hartree
dipole: -2.1783 -5.1285 0.3240
dipole: 5.5814
quadrupole: -55.7291 -50.0123 -46.2693
quadrupole: 10.2906 -2.0236 1.1654
quadrupole: -5.0589 0.6579 4.4009 10.2906 -2.0236 1.1654
hfenergy: -661.926004 hartree
pointgroup: C01 [X(C4H4N2S1)]
dipole: 0.4153182 2.1415707 -0.2511254 debye
dipolederiv: -0.7730329 -0.3703148 0.1355883 -0.4527037 -0.3216794 0.0863348 0.1778205 0.0922325 -0.1165876 -1.904481 -0.9057421 0.2971888 -0.9129367 -0.7009896 0.1838101 0.1252219 0.0983296 -0.2495726 -0.2509601 -0.0057891 -0.0021862 0.0792973 -0.1911884 0.0094382 0.0295569 -0.0019621 -0.2183362 1.0324433 0.3505057 -0.1748989 0.3952862 0.5201087 -0.123516 -0.0885318 -0.1075829 0.3766119 0.0475774 0.0092161 -0.006297 0.0397859 0.06592 -0.0017839 -0.0268863 0.0029054 0.169256 -0.018802 -0.0502385 -0.0378677 -0.1565952 0.0587494 0.022942 -0.0821982 0.0176492 -0.0699732 1.9080485 1.0486395 -0.3521626 1.1449712 0.6182462 -0.2051049 -0.3088648 -0.1666149 0.04149 -0.0520664 -0.0937639 0.0546953 -0.085194 0.0535179 -0.0438841 0.092768 0.0377481 -0.1000432 -0.0717093 0.0196063 0.0267797 -0.0722773 -0.1682356 0.0390035 0.0345882 -0.0062518 0.0981731 0.1141446 0.0640947 0.0224912 0.0570266 0.0768897 0.0002886 0.0037425 -0.0291096 -0.0385383 -0.031162 -0.066214 0.0366689 -0.0366604 -0.0113388 0.0324716 0.0427832 0.0626566 0.1075202 unknown
polarizability: 96.1449987|20.4448502|67.8165474|-10.1413047|-5.0573097|39.115004 unknown
InChI: InChI=1S/C4H4N2S/c5-2-1-3-6-4-7/h1,3H2
charge 0 multiplicity 1
11 atoms
S  -3.353197 -1.166736 0.439296
N  -1.000368 0.337541 -0.066196
N  2.491284 -1.327483 -0.096411
C  0.013942 1.203353 -0.57051
C  1.351946 1.061522 0.214495
C  1.980159 -0.259662 0.047904
C  -2.014974 -0.292495 0.12416
H  0.192044 0.991682 -1.642728
H  -0.318218 2.257264 -0.487823
H  1.17076 1.245295 1.288909
H  2.051424 1.839719 -0.144697
