program: Gaussian 09
title: 000029359
version: EM64L-G09RevD.01
frameworkgroup: C1[X(C13H19ClO)]
method: RPBEPBE
basis: SDD
operation: Freq
keyword: #p
keyword: freq=noraman
keyword: PBEPBE/SDD
title: #p freq=noraman PBEPBE/SDD
converged: YES YES NO NO
title: Mulliken charges:
elementType: Cl O C C C C C C C C C C C C C H H H H H H H H H H H H H H H H H H H
charge: -0.074696 -0.416937 -0.358140 -0.373918 -0.397987 -0.352718 -0.617894 -0.355895 0.421255 -0.695167 0.077221 -0.382230 -0.339767 -0.116378 -0.209810 0.198376 0.186976 0.195218 0.191129 0.213593 0.225847 0.187491 0.189457 0.204747 0.240776 0.195642 0.196494 0.210099 0.209701 0.217070 0.259783 0.254145 0.256228 0.360287
chargesum: 0.00000
title: Mulliken charges with hydrogens summed into heavy atoms:
elementType: Cl O C C C C C C C C C C C C C
charge: -0.074696 -0.056649 0.027212 0.012429 0.041453 0.024230 -0.172371 0.036241 0.421255 -0.058297 0.077221 -0.122447 -0.085621 -0.116378 0.046418
polarizability: 2.05684344e+02 1.51158966e+01 1.50138487e+02 1.68623205e+01 -7.69960936e+00 1.05535274e+02
1716.lowfreq: -6.3553 -4.0943 -0.0015 0.0001 0.0019 9.5899 18.7631 37.2408 52.5687
frequency: 18.4794 36.9103 51.6548 66.8933 93.6752 105.2623 122.6177 131.7923 150.9320 179.1838 202.3057 224.0537 237.2837 294.9130 305.2432 314.5758 350.1229 357.8603 398.2821 434.1645 463.9461 475.7905 550.9706 606.8388 627.6661 724.4335 725.8151 732.1740 747.9927 766.6859 818.4492 824.2616 866.2421 882.5527 890.3263 907.0366 942.5086 987.7229 991.5789 1026.6778 1038.3066 1059.3074 1072.1344 1078.6447 1079.2278 1112.8503 1117.2966 1148.5009 1181.0428 1189.6799 1221.3550 1227.1288 1248.4871 1266.7330 1272.9415 1282.1241 1289.5623 1293.3585 1295.1059 1309.9248 1338.7682 1354.8834 1356.1257 1388.1532 1389.1184 1412.5652 1463.5461 1464.0050 1466.4550 1471.4270 1476.0354 1477.8211 1483.5062 1488.9717 1497.9079 1582.1435 1621.4041 2935.9036 2950.2552 2951.9456 2959.0062 2968.5962 2971.7013 2972.0737 2986.9946 2995.9710 3012.6055 3024.3635 3035.8245 3049.0335 3068.2005 3071.7923 3151.1013 3160.8785 3180.7234 3583.9023
redmass: 5.0891 3.5291 2.2562 2.3721 3.0768 2.3267 3.8159 2.2103 2.1190 5.2535 3.3654 1.1526 4.5127 3.7489 1.2156 3.4783 3.7352 11.7241 3.6307 3.1270 3.1780 2.9620 3.9221 5.1935 7.4039 2.2930 1.2597 1.1805 2.1565 1.4855 1.4548 1.2609 3.6690 1.7206 1.7947 1.2692 1.3466 4.0690 1.2699 3.1617 3.4595 1.5768 2.5676 1.9271 2.2078 1.3951 2.4436 1.3855 2.3249 1.8212 1.2747 1.4408 1.6112 1.2903 1.3899 1.0417 1.3426 1.1693 1.1572 1.3989 1.4335 1.5565 1.6438 1.2179 5.4208 3.6597 1.0857 1.1367 1.7873 1.1252 1.0436 1.1451 1.1449 1.0991 1.1116 7.0367 7.0759 1.0688 1.0593 1.0590 1.0595 1.0600 1.0599 1.0391 1.0961 1.0986 1.1004 1.0972 1.1018 1.1010 1.1008 1.0992 1.0924 1.0885 1.0978 1.0654
irintensity: 0.2119 0.3575 0.0271 0.0230 0.2115 0.0936 0.0172 0.0236 0.0291 0.4294 0.2925 0.0088 0.4475 11.2882 117.4395 1.2078 6.1971 2.9208 1.3387 4.7978 11.5018 13.4173 3.3983 2.3329 31.9409 0.8509 14.2715 0.0701 2.4337 7.6556 42.1033 3.4375 25.7055 8.7685 10.7867 2.2953 0.3797 1.5017 1.3587 1.6287 1.5930 7.9434 0.7762 2.2356 0.3718 5.6396 13.8908 171.3850 55.3223 14.2213 10.6500 3.6468 1.7840 2.1169 2.7159 0.1084 10.1685 1.1209 1.6164 0.6054 0.9409 1.2036 0.1066 11.6540 17.7788 4.3807 2.9097 14.9998 88.3681 14.2768 14.6088 6.5259 14.1125 15.9601 20.1680 1.3101 0.9394 26.9325 5.8085 2.2151 19.9870 33.6224 126.7140 25.9775 3.6501 2.9352 2.4681 5.8451 40.0599 96.7341 97.3972 53.1017 2.8063 1.9456 3.8064 33.2872
temp: 298.150 k
press: 1.00000 atm
elementType: 17 8 6 6 6 6 6 6 6 6 6 6 6 6 6 1 1 1 1 1 1 1 1 1 1 1 1 1 1 1 1 1 1 1
symmnumber: 1
zpe: 754743.7 jmol-1
zpe.correction: 0.287467 hartree
zpe.thermalcorrener: 0.304383 hartree
zpe.thermalcorrenthalpy: 0.305328 hartree
zpe.thermalcorrgfe: 0.240643 hartree
zpe.sumelectzpe: -1040.907262 hartree
zpe.sumelectthermal: -1040.890345 hartree
zpe.sumelectthermalent: -1040.889401 hartree
zpe.sumelectthermalfe: -1040.954086 hartree
dipole: 3.2954 0.3747 0.8356
dipole: 3.4203
quadrupole: -106.8225 -102.1875 -99.8376
quadrupole: -4.1655 2.3523 -0.7178
quadrupole: -3.8733 0.7618 3.1116 -4.1655 2.3523 -0.7178
hfenergy: -1041.1947288 hartree
pointgroup: C01 [X(C13H19Cl1O1)]
dipole: 1.2822233 0.2641896 0.3112823 debye
polarizability: 203.2196915|20.2468173|151.1165285|15.9911427|-10.249403|107.0218854 unknown
InChI: InChI=1S/C13H19ClO/c1-2-3-4-5-6-7-11-10-12(14)8-9-13(11)15/h8-10,15H,2-7H2,1H3
charge 0 multiplicity 1
34 atoms
Cl -4.86837 -2.495759 -0.030346
O  -1.467063 2.475883 -0.195409
C  2.218117 -0.021823 0.677958
C  3.343363 -0.187892 -0.36825
C  0.804444 -0.066748 0.057793
C  4.761058 -0.118592 0.243083
C  -0.324438 0.077836 1.11991
C  5.885645 -0.285554 -0.804474
C  -1.718581 0.110026 0.512112
C  7.299101 -0.205732 -0.188312
C  -2.215086 1.284734 -0.123832
C  -2.550872 -1.035983 0.529376
C  -3.494744 1.314797 -0.719548
C  -3.822031 -0.996912 -0.071502
C  -4.311393 0.165205 -0.698301
H  2.308999 -0.820235 1.443779
H  2.358578 0.940329 1.215397
H  3.216632 -1.158461 -0.891519
H  3.241486 0.59886 -1.1449
H  0.712203 0.726314 -0.712692
H  0.662951 -1.025696 -0.478095
H  4.890074 0.853305 0.764326
H  4.866549 -0.904241 1.020384
H  -0.133954 0.988434 1.731023
H  -0.251567 -0.768444 1.827861
H  5.775784 0.496339 -1.583587
H  5.759956 -1.258798 -1.32141
H  7.44593 -0.996329 0.571726
H  7.460162 0.76981 0.308451
H  8.084207 -0.326779 -0.957152
H  -2.199614 -1.953282 1.0130
H  -3.837237 2.239489 -1.192577
H  -5.303716 0.17807 -1.157537
H  -0.597573 2.37323 0.264864
