program: Gaussian 09
title: 000029392
version: EM64L-G09RevD.01
frameworkgroup: C1[X(C17H21NO)]
method: RPBEPBE
basis: SDD
operation: Freq
keyword: #p
keyword: freq=noraman
keyword: PBEPBE/SDD
title: #p freq=noraman PBEPBE/SDD
converged: YES YES NO NO
title: Mulliken charges:
elementType: O N C C C C C C C C C C C C C C C C C H H H H H H H H H H H H H H H H H H H H H
charge: -0.286270 -0.491668 0.460728 -0.086071 -0.092997 -0.092319 -0.595228 -0.525614 -0.518540 -0.450592 -0.450601 -0.451183 0.155441 0.250184 -0.354833 -0.373197 -0.224221 -0.237630 -0.228930 0.197937 0.198670 0.198387 0.208576 0.204082 0.263497 0.196831 0.193609 0.263931 0.197797 0.192635 0.192401 0.197496 0.193256 0.202569 0.306307 0.272503 0.223473 0.230900 0.227699 0.230985
chargesum: 0.00000
title: Mulliken charges with hydrogens summed into heavy atoms:
elementType: O N C C C C C C C C C C C C C C C C C
charge: -0.286270 -0.185361 0.460728 0.111866 0.105673 0.106067 -0.182570 -0.065286 -0.061000 -0.060160 -0.060704 -0.055358 0.155441 0.250184 -0.082330 -0.149724 0.006680 -0.009930 0.002054
polarizability: 2.45912313e+02 -2.55580553e+00 1.72539455e+02 4.65203659e+00 3.39822703e+00 1.25699912e+02
1716.lowfreq: -13.5445 -0.0010 -0.0009 -0.0009 6.5286 22.5632 39.1360 45.9868 63.1421
frequency: 37.1658 41.0618 62.9114 96.1550 145.9352 174.3500 224.8255 271.0691 288.4342 301.5919 350.1003 382.3239 391.3767 395.0911 402.6917 411.2983 427.7835 434.6122 447.5022 484.4927 517.7842 587.1155 615.1367 638.5464 640.4028 670.0896 690.2899 704.5121 717.9348 769.9742 792.3405 801.9835 809.2780 851.0529 856.5801 872.6110 874.1896 883.8178 918.1773 934.8960 938.3408 949.2243 975.3085 976.7950 982.3142 986.8275 989.4287 1003.1626 1024.8489 1044.0303 1047.4269 1050.2542 1073.3328 1083.5913 1101.5956 1102.3520 1105.5992 1106.0478 1110.2225 1154.4044 1172.4479 1184.8324 1186.3568 1187.6930 1240.5558 1261.8669 1279.2823 1284.9037 1290.2076 1293.8276 1303.4018 1310.6125 1312.8250 1314.0883 1323.2423 1341.6356 1342.5929 1352.4036 1357.2384 1359.8455 1383.3456 1432.1306 1452.5323 1455.5511 1462.3232 1468.1461 1468.5359 1470.4331 1488.7385 1491.1491 1570.9595 1602.1460 1610.5810 2947.5404 2963.4002 2964.5642 2967.3032 2976.1726 2980.6439 2995.4684 2997.2348 3006.2171 3008.5193 3022.0467 3023.6621 3031.1372 3058.7960 3062.8785 3114.8106 3129.8144 3142.6944 3156.2046 3168.0762 3529.1214
redmass: 3.7871 4.6198 4.4205 5.2359 4.8856 4.3733 3.8953 2.6928 4.1137 2.0115 2.8988 2.8789 4.6355 4.6096 2.8288 2.9080 1.9200 1.8949 2.3343 3.3351 1.2181 4.1675 6.3086 3.7878 3.7867 5.5033 4.9866 1.5218 4.5983 3.4328 2.4378 3.2352 2.7380 3.0477 1.4272 1.5644 1.5630 1.5379 3.2534 1.5374 2.0294 2.0851 2.1694 2.2759 1.4084 2.4464 5.0541 1.3425 2.3958 1.8064 1.7853 1.7255 2.8469 1.7409 1.2391 1.5781 1.2207 1.1877 1.0145 3.1176 1.0584 1.1828 1.1786 1.1412 1.6384 1.7476 1.9049 1.8472 1.9005 2.3051 2.3647 1.5675 1.5713 1.3520 1.3185 1.4484 1.4777 1.4735 1.5852 1.6188 9.1253 2.2246 1.0831 1.0833 1.1137 1.8094 1.1221 1.0898 1.1548 1.9915 6.4901 6.7649 6.1373 1.0587 1.0629 1.0609 1.0621 1.0652 1.0657 1.0838 1.0832 1.1019 1.0839 1.1026 1.1026 1.1025 1.0990 1.0987 1.0873 1.0869 1.0921 1.0956 1.1005 1.0768
irintensity: 0.3570 0.9923 1.0117 6.2932 3.8814 1.1886 0.5877 0.8756 9.7748 0.0607 2.9485 1.2080 0.1904 0.0152 0.2440 1.3092 2.5456 0.3393 0.6484 2.6476 61.4115 20.7655 1.1531 0.7126 0.3555 2.1095 4.4801 92.1719 1.0908 0.3179 19.9450 3.2767 3.8539 3.7467 4.4683 0.0255 0.0458 0.0339 1.1616 2.0696 1.7601 5.0297 1.6816 6.8128 1.9433 1.2480 0.3869 1.5212 7.0123 0.7381 0.4487 0.0966 3.8465 19.8629 2.5511 1.6548 4.2871 5.0770 0.1712 9.1391 0.8638 1.1532 0.9592 10.0919 47.2490 1.0073 23.3672 1.8920 2.2026 111.8115 6.4712 2.7541 4.0140 1.9502 0.0458 2.3802 17.2647 28.6199 1.8287 0.6618 1.0402 5.1160 1.4556 1.6601 32.2065 136.6564 44.7462 16.0030 21.7327 163.7691 81.8735 46.9002 2.5043 38.0259 26.0804 29.1127 19.3214 15.8814 46.2174 119.8584 159.1205 32.6221 52.1986 33.6170 26.6189 93.1830 4.3764 22.6951 10.7818 1.5873 23.7009 18.5331 23.1955 11.3523
temp: 298.150 k
press: 1.00000 atm
elementType: 8 7 6 6 6 6 6 6 6 6 6 6 6 6 6 6 6 6 6 1 1 1 1 1 1 1 1 1 1 1 1 1 1 1 1 1 1 1 1 1
symmnumber: 1
zpe: 903332.1 jmol-1
zpe.correction: 0.344061 hartree
zpe.thermalcorrener: 0.359187 hartree
zpe.thermalcorrenthalpy: 0.360131 hartree
zpe.thermalcorrgfe: 0.301642 hartree
zpe.sumelectzpe: -789.017485 hartree
zpe.sumelectthermal: -789.002359 hartree
zpe.sumelectthermalent: -789.001415 hartree
zpe.sumelectthermalfe: -789.059904 hartree
dipole: 0.2879 3.3881 -1.1139
dipole: 3.5781
quadrupole: -99.1264 -112.1569 -116.1252
quadrupole: -3.6183 2.1711 2.6823
quadrupole: 10.0097 -3.0207 -6.9890 -3.6183 2.1711 2.6823
hfenergy: -789.361546 hartree
pointgroup: C01 [X(C17H21N1O1)]
dipole: -0.1277653 1.3371343 0.4212483 debye
polarizability: 245.837032|3.3836555|172.5087753|4.824025|-3.9343436|125.805873 unknown
InChI: InChI=1S/C17H21NO/c19-16(15-4-2-1-3-5-15)18-17-9-12-6-13(10-17)8-14(7-12)11-17/h1-5,12-14,18H,6-11H2
charge 0 multiplicity 1
40 atoms
O  0.990091 -1.788845 -0.452681
N  0.332699 0.380949 0.124271
C  -1.142291 0.186219 0.070469
C  -3.347493 1.414297 0.401568
C  -3.145019 -0.361031 -1.39689
C  -3.151355 -1.028858 1.050521
C  -1.801149 1.545617 0.437816
C  -1.597895 -0.226455 -1.359899
C  -1.604768 -0.894839 1.093594
C  -3.79495 1.000079 -1.026246
C  -3.800204 0.332551 1.420371
C  -3.594306 -1.444636 -0.378529
C  1.283632 -0.585616 -0.150248
C  2.723626 -0.131598 -0.051334
C  3.705913 -1.117494 0.22012
C  3.130144 1.214342 -0.250051
C  5.066901 -0.761901 0.321992
C  4.494287 1.569216 -0.155494
C  5.465034 0.584032 0.139064
H  -3.798945 2.390608 0.666508
H  -3.456327 -0.658057 -2.417603
H  -3.466975 -1.802197 1.778139
H  -1.472198 2.324971 -0.280793
H  -1.473684 1.859233 1.451459
H  -1.114135 -1.18133 -1.630672
H  -1.260231 0.541103 -2.084679
H  -1.271687 -0.600853 2.109345
H  -1.118961 -1.854921 0.845275
H  -4.899619 0.918843 -1.065395
H  -3.496817 1.776084 -1.760025
H  -3.505278 0.628578 2.447479
H  -4.905189 0.245671 1.409204
H  -4.695511 -1.567034 -0.414376
H  -3.14403 -2.421568 -0.642977
H  0.659908 1.281449 0.480615
H  3.375646 -2.154802 0.337646
H  2.397456 1.984563 -0.521157
H  5.817063 -1.530013 0.540087
H  4.80048 2.60801 -0.322087
H  6.522638 0.860734 0.213793
