program: Gaussian 09
title: 000029331
version: EM64L-G09RevD.01
frameworkgroup: C1[X(C8H18O3)]
method: RPBEPBE
basis: SDD
operation: Freq
keyword: #pfreq=noraman
keyword: PBEPBE/SDD
title: #p freq=noraman PBEPBE/SDD
converged: YES YES NO NO
title: Mulliken charges:
elementType: O O O C C C C C C C C H H H H H H H H H H H H H H H H H H
charge: -0.278607 -0.296608 -0.449144 -0.077942 -0.238593 -0.691738 -0.702165 -0.239658 -0.247977 -0.246918 -0.321073 0.212556 0.184226 0.178329 0.205993 0.194254 0.252135 0.221123 0.210387 0.204909 0.178916 0.198576 0.183976 0.208940 0.193542 0.201578 0.206517 0.204864 0.349601
chargesum: 0.00000
title: Mulliken charges with hydrogens summed into heavy atoms:
elementType: O O O C C C C C C C C
charge: -0.278607 -0.296608 -0.099543 0.134614 0.123962 -0.039355 -0.065745 0.137834 0.144939 0.148201 0.090309
polarizability: 1.17867664e+02 -1.51480757e+00 9.45288605e+01 3.32765483e+00 -2.58329471e+00 8.62444859e+01
1716.lowfreq: -0.7141 0.0004 0.0006 0.0010 4.8743 14.8592 24.4597 30.2723 37.3572
frequency: 22.3150 30.0596 37.0915 73.3306 87.3752 128.5841 139.9213 164.1059 196.8043 201.7334 230.3075 268.2408 291.8010 324.8357 357.5257 421.3665 447.6751 467.9211 507.2930 530.0659 786.2397 822.3387 845.6553 873.4180 913.1730 915.0382 921.2622 948.9277 970.4294 1002.2301 1006.1748 1038.4312 1067.9856 1078.2324 1097.0226 1110.5522 1138.0143 1152.5624 1188.9077 1190.3402 1197.9653 1215.3072 1230.5203 1254.1948 1294.6182 1328.3660 1335.5907 1340.2717 1348.2117 1375.8443 1385.2085 1386.5549 1396.3216 1413.0205 1453.3677 1456.5293 1463.1829 1465.2405 1468.5937 1471.5083 1480.6982 1482.7015 1490.7555 2898.5801 2918.0627 2931.6281 2940.2087 2948.1531 2968.3237 2968.3501 2973.5525 2974.8247 2992.7578 2996.0137 2999.1968 3058.4518 3066.5661 3074.0073 3081.4732 3095.4922 3534.7709
redmass: 4.5738 2.6092 3.2180 4.0227 3.8062 2.5678 2.9392 3.3746 1.1852 1.9808 1.1017 2.4400 2.8196 2.4873 2.4780 1.9782 2.9066 1.1877 2.5451 2.6233 2.1706 2.8020 2.5194 2.7309 1.6286 1.5469 1.2079 1.4371 1.7579 2.5357 3.1141 2.9370 3.6983 2.9228 1.8619 2.8263 2.0191 1.6861 1.5393 1.2221 1.1896 1.2313 1.2647 1.1205 1.3242 1.1796 1.2783 1.3597 1.3893 1.2194 1.2442 1.3305 1.2964 1.5291 1.0879 1.0818 1.0876 1.0587 1.0478 1.0822 1.0567 1.0663 1.0599 1.0543 1.0568 1.0557 1.0580 1.1036 1.0449 1.0645 1.0400 1.1006 1.0858 1.0993 1.1033 1.0992 1.0988 1.0987 1.0968 1.0990 1.0651
irintensity: 0.5923 0.7686 2.2983 2.6003 2.2102 5.7193 5.2169 6.3439 2.6335 4.6029 0.3128 0.7394 2.1035 1.5619 2.5852 0.6471 7.9993 150.7581 10.7567 11.3889 7.1659 1.8614 12.1703 19.8889 21.5634 3.9822 2.0079 5.8184 8.9457 54.1038 63.4524 43.7113 165.0772 52.5271 11.4508 25.7570 5.2810 0.6481 6.2022 6.4690 4.5401 29.5887 3.7287 6.4786 4.9615 25.2828 13.8927 6.1267 5.5872 20.9287 17.1479 19.0420 15.5143 0.9229 14.1360 15.8647 4.1180 2.0938 0.8749 9.1839 7.5865 9.6096 22.9353 52.6896 42.1373 54.3611 103.4663 61.2863 24.8497 30.0938 14.8207 70.6339 31.0936 148.1801 20.5593 21.8740 68.4370 59.7070 41.1620 24.4698 7.7289
temp: 298.150 k
press: 1.00000 atm
elementType: 8 8 8 6 6 6 6 6 6 6 6 1 1 1 1 1 1 1 1 1 1 1 1 1 1 1 1 1 1
symmnumber: 1
zpe: 664826.3 jmol-1
zpe.correction: 0.253219 hartree
zpe.thermalcorrener: 0.267696 hartree
zpe.thermalcorrenthalpy: 0.268640 hartree
zpe.thermalcorrgfe: 0.209561 hartree
zpe.sumelectzpe: -540.332652 hartree
zpe.sumelectthermal: -540.318175 hartree
zpe.sumelectthermalent: -540.317231 hartree
zpe.sumelectthermalfe: -540.376310 hartree
dipole: 1.8432 -2.2461 -0.9479
dipole: 3.0563
quadrupole: -76.8169 -66.1848 -68.0400
quadrupole: 4.3457 11.0150 -2.9196
quadrupole: -6.4696 4.1624 2.3072 4.3457 11.0150 -2.9196
hfenergy: -540.5858705 hartree
pointgroup: C01 [X(C8H18O3)]
dipole: -0.7262298 0.8977349 -0.3354438 debye
polarizability: 117.9970374|-1.1982316|94.1938196|-2.8792975|2.9856331|86.450154 unknown
InChI: InChI=1S/C8H18O3/c1-8(2)7-11-6-5-10-4-3-9/h8-9H,3-7H2,1-2H3
charge 0 multiplicity 1
29 atoms
O  -1.078904 0.764923 -0.250125
O  1.89792 0.315976 0.037286
O  4.10858 -0.966261 1.223179
C  -3.236539 -0.358446 -0.367832
C  -2.34591 0.577792 0.466604
C  -2.579452 -1.74822 -0.526465
C  -4.64001 -0.46157 0.273503
C  -0.120822 1.578782 0.496465
C  1.201527 1.57258 -0.256948
C  3.129269 0.143217 -0.749512
C  3.790145 -1.121531 -0.198997
H  -3.335779 0.09964 -1.372801
H  -2.846249 1.562695 0.616155
H  -2.152762 0.131294 1.470149
H  -3.176691 -2.393413 -1.197001
H  -2.502095 -2.257084 0.454465
H  -1.5622 -1.649453 -0.941689
H  -5.294539 -1.118489 -0.327671
H  -5.130357 0.527474 0.35006
H  -4.578407 -0.893063 1.291603
H  -0.496164 2.623493 0.590053
H  0.033839 1.17035 1.519456
H  1.830357 2.433456 0.062608
H  1.002557 1.660969 -1.346032
H  2.890181 0.036522 -1.83014
H  3.797376 1.021197 -0.608555
H  4.749803 -1.310709 -0.708647
H  3.115359 -1.987746 -0.362396
H  3.280867 -0.628774 1.655923
