program: Gaussian 09
title: 000029322
version: EM64L-G09RevD.01
frameworkgroup: C1[X(C4H4BrN3O2)]
method: RPBEPBE
basis: SDD
operation: Freq
keyword: #p
keyword: freq=noraman
keyword: PBEPBE/SDD
title: #p freq=noraman PBEPBE/SDD
converged: NO YES NO NO
title: Mulliken charges:
elementType: Br O O N N N C C C C H H H H
charge: 0.117169 -0.216216 -0.180744 -0.353940 -0.030336 0.067764 0.233072 0.199683 -0.188676 -0.750871 0.340620 0.281793 0.240356 0.240325
chargesum: 0.00000
title: Mulliken charges with hydrogens summed into heavy atoms:
elementType: Br O O N N N C C C C
charge: 0.117169 -0.216216 -0.180744 -0.013320 -0.030336 0.067764 0.233072 0.199683 -0.188676 0.011604
polarizability: 1.24146433e+02 9.82673364e-01 1.05147395e+02 1.36758197e-02 1.16960903e-03 3.72242606e+01
1716.lowfreq: -6.9160 -0.0005 -0.0003 0.0001 3.1761 5.0276 38.1470 83.3845 132.9381
frequency: 38.1350 83.3832 132.9371 140.6563 173.8130 193.9638 304.4919 315.2496 377.6692 405.2963 555.4487 607.4374 657.6960 681.1541 688.3776 720.2948 760.0266 955.1248 972.2739 1035.6541 1049.3649 1180.5908 1215.8744 1270.9063 1310.7442 1350.4639 1371.6884 1403.5980 1462.9319 1467.5501 1482.8552 1546.1694 2990.6030 3068.8019 3126.3224 3566.2660
redmass: 15.8123 1.0373 18.9622 4.2412 6.7262 4.2430 16.2986 5.4470 4.1506 9.4622 7.1337 10.6646 5.9748 1.1544 6.2604 12.5360 10.4166 4.6182 2.1584 4.7205 1.4711 3.4035 3.3804 12.1230 5.2186 3.5791 12.2725 1.2427 1.2851 1.0432 3.7539 4.6648 1.0389 1.0986 1.0969 1.0821
irintensity: 0.0860 0.0794 0.3694 0.1260 3.0834 0.5699 2.6234 1.0915 3.6217 1.3182 0.6022 15.4620 0.4995 104.7976 10.4490 1.2528 30.0938 16.9856 19.4391 23.0922 4.8885 72.5603 68.3943 66.6954 38.8738 39.7643 102.3544 6.3129 64.0522 20.1975 84.1216 103.7586 18.0973 13.7574 1.7990 55.0457
temp: 298.150 k
press: 1.00000 atm
elementType: 35 8 8 7 7 7 6 6 6 6 1 1 1 1
symmnumber: 1
zpe: 231261.0 jmol-1
zpe.correction: 0.088083 hartree
zpe.thermalcorrener: 0.097657 hartree
zpe.thermalcorrenthalpy: 0.098601 hartree
zpe.thermalcorrgfe: 0.050986 hartree
zpe.sumelectzpe: -482.148692 hartree
zpe.sumelectthermal: -482.139118 hartree
zpe.sumelectthermalent: -482.138174 hartree
zpe.sumelectthermalfe: -482.185788 hartree
dipole: 1.3962 -8.3936 0.0002
dipole: 8.5089
quadrupole: -62.9517 -70.9905 -65.7542
quadrupole: -7.4624 -0.0006 -0.0019
quadrupole: 3.6138 -4.4250 0.8112 -7.4624 -0.0006 -0.0019
hfenergy: -482.2367745 hartree
pointgroup: C01 [X(C4H4Br1N3O2)]
dipole: 2.8455771 1.7634023 -0.0000788 debye
dipolederiv: -0.0226604 0.1504858 0.0000126 0.2226115 -0.4766742 -0.000042 0.0000654 -0.0001817 0.1060958 -0.7829099 0.026602 0.0001624 0.1528156 -0.5022622 -0.0001749 0.0000613 -0.0001302 -0.2365148 -0.4767411 -0.2170522 -0.0000186 -0.1162563 -0.8424767 -0.0001238 0.0000316 -0.0003136 -0.2080545 -0.6593472 -0.228302 0.0000146 0.1295738 -0.3717685 -0.0000027 0.0000074 0.0000808 -0.1973475 -0.4050075 0.2583303 0.0000459 -0.0396502 -0.4648137 -0.000007 0.0000483 -0.0001588 -0.2031319 1.5179015 0.5226357 -0.0001551 0.1880568 1.3322346 0.0003382 -0.0001733 0.0003872 0.1923479 0.5594448 -0.2221258 -0.0000871 -0.1396795 0.2468684 0.0000036 -0.0001581 0.000023 0.0360075 -0.3833441 -0.3169101 0.0000157 -0.3897119 -0.2808595 -0.0000535 0.0000085 0.0001359 0.0922542 0.5052502 -0.0147171 -0.0000408 -0.0174163 1.0687904 0.0000603 -0.000027 0.0001985 -0.0882521 -0.1539389 0.0636395 0.0000217 0.0010594 -0.0371678 0.0000533 0.0001644 0.0000211 0.0790032 0.2293446 -0.0015242 0.0000114 0.0161665 0.1830799 -0.0000045 0.000006 -0.0000066 0.3449708 0.1030207 -0.0443643 0.000022 0.0321395 -0.0326873 0.0000646 -0.0000347 0.000099 0.1383785 -0.0154999 0.0116936 0.0575736 -0.0197876 0.0889381 0.0858911 0.109053 0.0528457 -0.0279648 -0.0155128 0.0116087 -0.0575784 -0.0199212 0.0887985 -0.0860028 -0.1090529 -0.0530003 -0.0277922 unknown
polarizability: 112.4265038|-9.2885029|116.8673236|-0.008134|0.0110559|37.2242606 unknown
InChI: InChI=1S/C4H4BrN3O2/c1-2-6-3(5)4(7-2)8(9)10/h6H,1H3
charge 0 multiplicity 1
14 atoms
Br -0.853744 2.790067 0.00014
O  -2.667009 0.130181 0.000381
O  -1.882892 -2.022038 -0.000421
N  1.445484 1.060965 -0.000083
N  0.753696 -1.083707 -0.000076
N  -1.709994 -0.747387 0.000138
C  1.837638 -0.286572 -0.000167
C  -0.351702 -0.23247 0.000049
C  0.051665 1.112264 0.00006
C  3.263774 -0.736182 -0.000345
H  2.058845 1.87716 -0.000106
H  3.278072 -1.836375 0.000079
H  3.808257 -0.383011 -0.895214
H  3.808709 -0.382295 0.893964
