program: Gaussian 09
title: 000029346
version: EM64L-G09RevD.01
frameworkgroup: C1[X(C8H14O2S)]
method: RPBEPBE
basis: SDD
operation: Freq
keyword: #p
keyword: freq=noraman
keyword: PBEPBE/SDD
title: #p freq=noraman PBEPBE/SDD
converged: YES YES NO NO
title: Mulliken charges:
elementType: S O O C C C C C C C C H H H H H H H H H H H H H H
charge: -0.014616 -0.274685 -0.247480 0.037375 -0.444533 -0.431593 -0.396551 -0.399537 -0.388286 0.345138 -0.806364 0.235875 0.207455 0.217365 0.234393 0.202605 0.208534 0.198970 0.201577 0.208026 0.205398 0.191899 0.294516 0.283135 0.131383
chargesum: 0.00000
title: Mulliken charges with hydrogens summed into heavy atoms:
elementType: S O O C C C C C C C C
charge: 0.116767 -0.274685 -0.247480 0.273250 -0.019713 0.005405 0.010953 0.010067 0.009011 0.345138 -0.228713
polarizability: 1.39413884e+02 2.83260315e-01 9.26427772e+01 -5.04298642e+00 -5.39668236e+00 8.62586058e+01
1716.lowfreq: -10.6042 0.0014 0.0022 0.0028 3.0584 11.8113 16.8193 49.6982 69.1835
frequency: 10.8522 49.6104 68.9842 99.9968 153.7389 210.8815 220.7064 232.6076 260.8975 328.2430 335.7032 430.7891 439.3711 458.3050 535.3128 552.0702 663.5750 702.5204 787.6684 792.6007 813.2989 831.7142 864.2866 884.0757 896.2758 923.3256 939.2598 974.1106 997.6204 1044.6101 1054.2335 1084.0668 1109.3753 1117.8093 1152.5226 1192.2263 1201.4170 1240.5248 1254.7632 1260.0385 1280.1327 1303.5534 1309.0489 1332.4002 1338.0779 1340.7167 1350.5780 1362.5926 1431.6182 1463.7325 1465.2239 1466.0063 1473.8141 1482.2764 1628.5849 2425.4052 2972.3411 2973.6032 2976.1282 2987.7090 2991.2068 3014.7555 3035.3252 3036.8708 3038.5697 3047.0182 3057.6617 3065.8909 3134.6817
redmass: 6.4532 4.7255 4.3111 3.3615 2.6247 1.4315 1.7323 4.5028 3.4850 2.2536 3.1701 3.0615 3.1898 2.1283 2.3352 3.5487 4.4532 2.8881 1.5695 2.0331 1.6469 3.0470 2.6971 1.8657 1.6043 1.7887 4.2910 1.6038 2.7050 1.8295 1.1051 1.3026 2.5807 1.9145 2.2978 1.4399 1.4744 1.3102 1.2735 1.3081 1.4112 1.2659 1.3242 1.3583 1.4713 1.4733 1.5549 1.5002 1.0931 1.0855 1.0894 1.0917 1.0826 1.0976 10.3511 1.0375 1.0662 1.0613 1.0626 1.0618 1.0634 1.0835 1.0628 1.0955 1.0982 1.1013 1.1024 1.1028 1.1002
irintensity: 2.4259 1.0172 0.6075 1.9650 5.8333 44.0057 5.7217 3.7144 6.4038 5.4961 5.8735 2.2129 2.0115 1.2331 2.4268 3.2850 5.7882 8.2328 1.5092 3.6120 4.9148 10.6406 2.3739 1.5792 16.0200 5.0677 63.9864 4.7070 76.1768 0.5409 0.2131 11.0631 21.0732 218.4991 0.9833 113.7774 30.3055 0.6545 2.8611 6.8795 78.1619 22.4318 0.6628 0.4425 0.9035 0.4935 1.7700 2.8547 24.7519 1.1469 8.1277 13.4536 20.8522 3.7777 140.0801 7.4157 30.1099 35.5280 32.4929 10.0908 19.2479 16.4672 10.0067 57.4499 61.2262 40.6651 15.6026 73.5299 1.1950
temp: 298.150 k
press: 1.00000 atm
elementType: 16 8 8 6 6 6 6 6 6 6 6 1 1 1 1 1 1 1 1 1 1 1 1 1 1
symmnumber: 1
zpe: 544034.8 jmol-1
zpe.correction: 0.207212 hartree
zpe.thermalcorrener: 0.219226 hartree
zpe.thermalcorrenthalpy: 0.220170 hartree
zpe.thermalcorrgfe: 0.166803 hartree
zpe.sumelectzpe: -860.881212 hartree
zpe.sumelectthermal: -860.869198 hartree
zpe.sumelectthermalent: -860.868253 hartree
zpe.sumelectthermalfe: -860.921621 hartree
dipole: -3.1323 -0.0238 1.2680
dipole: 3.3793
quadrupole: -77.7654 -75.2880 -73.8660
quadrupole: 2.5195 2.7947 1.4506
quadrupole: -2.1256 0.3518 1.7738 2.5195 2.7947 1.4506
hfenergy: -861.0884238 hartree
pointgroup: C01 [X(C8H14O2S1)]
dipole: 1.2204243 0.1020582 -0.5174446 debye
dipolederiv: -0.2072844 0.0804018 -0.047299 0.1303066 0.0672252 0.0381634 -0.0674271 0.0811051 -0.165401 -1.8742563 0.1191932 0.1507507 0.2432429 -0.4550517 -0.1067508 0.0499041 -0.0974538 -0.3495506 -0.7783152 -0.0532314 -0.0438094 0.2273592 -0.5708406 -0.2493173 0.2000893 -0.2716092 -0.5572514 0.9958982 0.0179164 -0.0242038 0.1583938 0.3037637 -0.0567765 0.1670149 -0.0948916 0.2502889 -0.1190648 -0.008222 -0.022612 -0.0283348 0.0260239 0.0092912 -0.0718591 0.0265205 0.1341639 -0.1407012 -0.0091281 -0.0269709 -0.0404982 -0.0319978 0.0341383 -0.0838936 0.0515394 0.1064966 0.0980099 -0.0173672 -0.0088826 0.0605733 0.0552483 0.0321486 0.0504404 0.005232 0.1490708 0.1019793 0.0264997 -0.0135987 -0.0271698 0.0793125 0.0048768 0.0655589 0.0410698 0.1437917 0.0513183 0.0024742 0.0068408 -0.0110888 0.0410274 0.024667 -0.0433361 0.017604 0.1430385 1.8358358 -0.1014151 -0.0344527 -0.5284377 0.6231466 0.4162767 -0.1569613 0.4735749 0.5471164 -0.1339348 -0.0136163 -0.1658207 -0.1193885 0.0175683 -0.0178048 -0.3164153 -0.1507836 0.0836448 -0.0152913 0.0032369 0.0355564 -0.038932 0.0270369 -0.0281877 -0.0316143 -0.0016314 -0.0919446 0.0539056 0.0164249 0.0020628 0.0218202 0.068592 -0.0126987 0.0053653 -0.0783862 -0.1429555 0.0270891 -0.0865396 0.0353673 -0.0633916 -0.1081773 0.0801938 0.0489683 0.0964557 0.0322882 -0.0371215 0.1185311 -0.0098796 0.1114375 -0.0475958 0.0095861 0.0109921 -0.0125821 0.0719623 0.070084 -0.0252064 0.0195961 -0.0224776 0.0444459 -0.0765862 0.0037134 -0.0173756 -0.1415295 -0.0986076 0.1247097 -0.0015291 0.1298903 -0.1118402 0.0066017 0.0148274 -0.0199844 0.0794208 0.050875 -0.0283495 0.0436102 -0.0432478 0.0519091 -0.0643722 -0.0093223 -0.011163 -0.1816861 0.0258465 0.0325509 0.0239752 0.0267269 0.0623035 -0.0325984 -0.0093635 -0.0971767 -0.1628765 -0.0223768 -0.0725107 0.0287362 -0.0857963 -0.1384618 0.0898862 0.0351355 0.1209963 0.0301952 -0.202197 -0.0600459 -0.0691983 -0.0698149 0.0259749 -0.0107154 -0.1048006 -0.0178364 0.0493805 0.0834156 0.0132205 0.0072327 0.0316694 0.0122811 -0.0434355 0.0812598 -0.0301637 -0.180298 0.0637004 0.0289786 0.0533936 -0.0084535 0.0056096 -0.0612377 0.0565214 -0.0442956 0.0792458 -0.0039841 -0.0351588 0.0375674 -0.0278525 0.007317 0.1118184 0.0221854 0.0705887 -0.0163161 0.1751772 -0.0733469 0.0235677 -0.026536 -0.054821 -0.0971671 0.0830169 -0.0393533 0.089705 unknown
polarizability: 138.8679661|4.1928545|93.1666348|-6.3338184|4.7250842|86.2806665 unknown
InChI: InChI=1S/C8H14O2S/c9-8(6-11)10-7-4-2-1-3-5-7/h7,11H,1-6H2
charge 0 multiplicity 1
25 atoms
S  -4.578868 -0.709728 0.247004
O  -0.712742 -0.538823 -0.547125
O  -1.904526 0.949715 0.805188
C  0.590528 -0.090225 0.071095
C  1.563024 -1.266678 -0.076243
C  1.089765 1.178206 -0.641929
C  2.961569 -0.870097 0.46366
C  2.486417 1.575052 -0.09899
C  3.4935 0.407258 -0.230761
C  -1.871243 0.076179 -0.094128
C  -3.078908 -0.433048 -0.865648
H  0.387865 0.133296 1.136719
H  1.638107 -1.536719 -1.147799
H  1.169656 -2.149343 0.460645
H  0.368296 2.002041 -0.494662
H  1.156214 0.971754 -1.728582
H  3.665188 -1.71128 0.31813
H  2.898503 -0.692545 1.557064
H  2.396872 1.864456 0.968162
H  2.853831 2.466908 -0.640624
H  4.470555 0.695837 0.201683
H  3.666859 0.193659 -1.305626
H  -2.855931 -1.39647 -1.344376
H  -3.343228 0.304336 -1.643264
H  -4.449802 0.49906 0.914805
