program: Gaussian 09
title: 000029338
version: EM64L-G09RevD.01
frameworkgroup: C1[X(C8H20O4Si)]
method: RPBEPBE
basis: SDD
operation: Freq
keyword: #p
keyword: freq=noraman
keyword: PBEPBE/SDD
title: #p freq=noraman PBEPBE/SDD
converged: YES YES NO NO
title: Mulliken charges:
elementType: Si O O O O C C C C C C C C H H H H H H H H H H H H H H H H H H H H
charge: 1.253361 -0.433913 -0.434624 -0.435834 -0.435615 -0.798621 -0.795817 -0.796381 -0.791316 -0.297430 -0.301907 -0.296655 -0.300545 0.217450 0.251992 0.218997 0.249336 0.221470 0.248323 0.250449 0.217907 0.186412 0.228129 0.197544 0.226163 0.189645 0.218612 0.218591 0.196793 0.330965 0.331352 0.332755 0.332410
chargesum: 0.00000
title: Mulliken charges with hydrogens summed into heavy atoms:
elementType: Si O O O O C C C C C C C C
charge: 1.253361 -0.102948 -0.103272 -0.103079 -0.103205 -0.329178 -0.327483 -0.326588 -0.322959 0.117111 0.121801 0.111601 0.114839
polarizability: 1.34495158e+02 -1.30259317e-01 1.33406052e+02 -1.96856259e+00 1.88607082e+00 1.15744130e+02
1716.lowfreq: -0.0005 0.0015 0.0015 8.3000 12.8295 14.9469 25.8179 33.9492 43.0967
frequency: 25.2992 33.8542 42.8928 50.5714 67.4788 75.0488 78.7239 88.1444 90.7705 114.0013 143.3352 149.9513 216.7617 232.2086 235.1697 267.3953 271.1905 289.1454 312.3920 316.5092 323.9226 336.5870 380.6399 418.7427 426.3592 657.2391 695.5353 704.7444 709.8067 748.7848 754.7062 763.7631 802.0327 913.2383 923.7690 930.9229 940.3858 943.8430 965.9416 971.8327 975.2636 1020.7917 1022.8701 1036.7598 1041.6421 1114.3381 1119.3488 1120.6871 1128.3476 1194.3204 1202.6458 1208.7095 1216.2326 1274.2753 1278.7885 1284.0256 1287.7077 1320.7229 1321.9129 1324.1905 1325.9760 1379.5314 1380.8243 1382.0561 1384.2801 1436.9465 1439.4188 1444.0698 1445.7459 1473.6294 1475.8920 1478.3600 1481.8385 2939.2451 2940.7867 2948.3147 2950.7374 2965.1023 2965.5460 2966.1744 2967.3872 3026.1618 3027.9207 3029.2895 3030.3361 3063.8899 3066.9933 3069.1403 3071.6216 3556.8559 3557.0381 3558.1487 3558.3136
redmass: 4.2493 4.8162 5.5046 6.2513 2.0676 1.7912 4.5647 1.8321 1.7844 3.3805 3.5294 3.6003 2.4901 4.9316 4.8312 2.1867 2.4602 2.0057 1.1867 1.3174 1.3235 1.5105 4.7663 5.0562 4.7311 3.4323 1.1879 2.3822 2.7874 1.1950 1.3701 1.4559 5.9974 1.2943 2.2877 2.9940 5.0745 3.9429 1.4558 1.7360 2.1572 4.4052 4.2555 3.7462 3.7863 1.1105 1.1167 1.1450 1.1409 1.3102 1.2941 1.2995 1.2849 1.1972 1.1977 1.1995 1.1720 1.2457 1.2286 1.2250 1.2389 1.1927 1.1887 1.1922 1.1972 1.0789 1.0802 1.0872 1.0795 1.0847 1.0818 1.0832 1.0824 1.0701 1.0701 1.0696 1.0689 1.0609 1.0610 1.0610 1.0606 1.0952 1.0958 1.0951 1.0949 1.0969 1.0960 1.0957 1.0967 1.0661 1.0661 1.0661 1.0661
irintensity: 2.9654 0.6519 4.2547 0.0715 13.3075 0.7938 3.6515 5.6655 2.1611 2.5615 2.4936 0.4124 3.3857 0.0526 0.9218 17.3248 27.7863 12.8804 159.3028 74.2842 239.7869 81.7124 7.4486 25.6356 34.1437 0.0448 0.5681 1.0361 0.5535 9.6813 57.0211 62.0992 66.0482 30.4676 76.6481 105.2199 147.6681 10.4885 0.8788 1.7886 1.6762 149.0619 193.2693 0.9025 2.7340 81.6814 92.4282 15.2378 44.5423 60.6758 62.8668 6.1363 1.1586 3.8463 5.6310 7.2093 2.0037 3.3440 5.1220 3.3904 0.6532 31.0279 9.1072 41.8928 42.5711 1.5873 0.8796 1.4616 42.1045 11.7617 1.0147 0.4082 0.0427 73.3893 42.0178 37.0023 72.8944 3.0440 7.6426 16.0799 58.7602 4.1210 7.8732 9.8003 23.8946 24.9055 50.2502 44.4642 24.7152 7.9566 11.3993 9.4855 6.7120
temp: 298.150 k
press: 1.00000 atm
elementType: 14 8 8 8 8 6 6 6 6 6 6 6 6 1 1 1 1 1 1 1 1 1 1 1 1 1 1 1 1 1 1 1 1
symmnumber: 1
zpe: 727896.5 jmol-1
zpe.correction: 0.277241 hartree
zpe.thermalcorrener: 0.296415 hartree
zpe.thermalcorrenthalpy: 0.297359 hartree
zpe.thermalcorrgfe: 0.227383 hartree
zpe.sumelectzpe: -905.994419 hartree
zpe.sumelectthermal: -905.975245 hartree
zpe.sumelectthermalent: -905.974301 hartree
zpe.sumelectthermalfe: -906.044277 hartree
dipole: 1.6120 -1.9285 0.1339
dipole: 2.5171
quadrupole: -99.6807 -119.3709 -79.7579
quadrupole: 0.7375 -4.0883 3.4403
quadrupole: -0.0776 -19.7677 19.8453 0.7375 -4.0883 3.4403
hfenergy: -906.2716602 hartree
pointgroup: C01 [X(C8H20O4Si1)]
dipole: 0.6334428 -0.7588519 0.060025 debye
polarizability: 134.5168459|-0.1508357|133.4243248|-1.8595372|1.7995129|115.7041695 unknown
InChI: InChI=1S/C8H20O4Si/c9-1-5-13(6-2-10,7-3-11)8-4-12/h9-12H,1-8H2
charge 0 multiplicity 1
33 atoms
Si 0.012478 -0.018856 -0.002047
O  2.823217 2.915785 -1.298493
O  -2.845588 2.876799 1.268005
O  2.881778 -2.889963 1.301615
O  -2.981214 -2.758258 -1.305183
C  1.104561 1.091469 -1.142592
C  -1.107375 1.072307 1.127258
C  1.116432 -1.107995 1.149361
C  -1.069196 -1.136887 -1.145024
C  2.089946 2.008898 -0.397241
C  -2.097095 1.977528 0.371314
C  2.160278 -1.96354 0.41064
C  -2.07463 -2.03132 -0.398168
H  1.662776 0.42682 -1.83652
H  0.441387 1.715321 -1.774698
H  -1.663151 0.400436 1.815948
H  -0.460468 1.706116 1.766305
H  1.624444 -0.441546 1.87843
H  0.459516 -1.776545 1.741364
H  -1.624751 -0.487341 -1.850719
H  -0.39306 -1.764874 -1.763786
H  2.804147 1.405207 0.205872
H  1.558285 2.693973 0.284903
H  -2.798645 1.366869 -0.238236
H  -1.565945 2.66857 -0.305188
H  2.879786 -1.312943 -0.134057
H  1.679914 -2.632567 -0.324001
H  -2.759422 -1.426127 0.22095
H  -1.542804 -2.743448 0.269616
H  3.275419 2.374413 -1.99472
H  -3.338752 2.327765 1.929464
H  3.290831 -2.36788 2.038022
H  -2.437601 -3.307382 -1.925693
