program: Gaussian 09
title: 000029332
version: EM64L-G09RevD.01
frameworkgroup: C1[X(C5H8N2O6)]
method: RPBEPBE
basis: SDD
operation: Freq
keyword: #pfreq=noraman
keyword: PBEPBE/SDD
title: #p freq=noraman PBEPBE/SDD
converged: YES YES NO NO
title: Mulliken charges:
elementType: O O O O O O N N C C C C C H H H H H H H H
charge: -0.259444 -0.232765 -0.167175 -0.170240 -0.152914 -0.169115 0.123242 0.154055 -0.403491 -0.091220 -0.503761 0.252114 -0.501444 0.277406 0.277474 0.305533 0.274034 0.254612 0.245252 0.247315 0.240534
chargesum: 0.00000
title: Mulliken charges with hydrogens summed into heavy atoms:
elementType: O O O O O O N N C C C C C
charge: -0.259444 -0.232765 -0.167175 -0.170240 -0.152914 -0.169115 0.123242 0.154055 0.151389 0.214313 0.024884 0.252114 0.231657
polarizability: 1.08395327e+02 1.87984413e+00 9.17424614e+01 4.00800694e+00 -8.97949528e+00 7.37224887e+01
1716.lowfreq: -7.2672 -0.0012 -0.0011 -0.0008 1.0313 6.4900 19.9495 23.7449 28.2506
frequency: 19.8990 23.7143 28.1871 48.0578 65.0953 89.8365 104.9085 147.3237 170.2819 195.3731 231.1586 267.0086 294.0746 386.2457 424.3653 491.3459 508.5444 559.4324 637.1991 656.1177 667.8111 736.1579 772.4417 817.2745 829.0220 868.0394 953.6402 1013.9052 1062.7521 1101.4429 1114.7485 1147.3770 1151.4153 1164.0039 1183.8298 1228.8825 1231.4085 1265.1555 1272.6432 1318.6211 1367.2195 1424.0587 1433.4756 1436.5587 1450.0378 1454.0471 1459.8705 1462.5521 1646.0007 2994.5537 3009.9851 3031.3469 3068.5951 3092.5243 3107.2384 3114.2590 3157.5241
redmass: 11.3861 8.5507 9.2831 5.1322 4.2990 1.0904 3.2763 7.7020 4.2844 3.5304 6.4302 5.4010 4.6186 12.0672 4.7733 5.8235 8.2794 3.0760 4.5593 5.9352 3.4513 10.8196 4.0053 4.6634 2.3480 7.1122 5.6722 2.0793 3.8654 2.1006 1.2733 2.1546 1.6997 4.8922 1.7834 2.8247 1.9299 1.5162 1.2129 1.4202 1.6973 1.2011 2.1741 6.2159 1.5676 1.0497 1.1106 1.0522 8.9398 1.0655 1.0295 1.0609 1.0954 1.0951 1.0945 1.1050 1.1051
irintensity: 0.6393 1.1883 0.0871 2.7503 0.3827 0.2025 1.8813 4.1550 9.0056 7.1435 2.4395 3.0015 23.7384 0.9622 4.4593 17.8011 6.2507 3.3822 3.6131 0.3530 10.2379 23.7141 48.0051 5.8315 7.6943 11.4169 18.7193 3.3079 3.3486 6.4401 0.6828 96.8966 68.3022 200.9566 41.3662 22.1277 29.6928 42.9604 25.3199 85.7002 9.3840 24.9213 44.0336 154.3689 65.2976 16.4713 26.8126 16.7910 165.1277 4.0708 26.9193 4.9425 2.4452 1.9810 1.7605 23.1586 12.7896
temp: 298.150 k
press: 1.00000 atm
elementType: 8 8 8 8 8 8 7 7 6 6 6 6 6 1 1 1 1 1 1 1 1
symmnumber: 1
zpe: 382557.3 jmol-1
zpe.correction: 0.145708 hartree
zpe.thermalcorrener: 0.159949 hartree
zpe.thermalcorrenthalpy: 0.160893 hartree
zpe.thermalcorrgfe: 0.100212 hartree
zpe.sumelectzpe: -754.978427 hartree
zpe.sumelectthermal: -754.964186 hartree
zpe.sumelectthermalent: -754.963242 hartree
zpe.sumelectthermalfe: -755.023923 hartree
dipole: 4.9415 0.4947 -1.6967
dipole: 5.2481
quadrupole: -74.0943 -88.7681 -74.3190
quadrupole: 3.4111 2.9802 1.3788
quadrupole: 4.9662 -9.7076 4.7415 3.4111 2.9802 1.3788
hfenergy: -755.1241353 hartree
pointgroup: C01 [X(C5H8N2O6)]
dipole: -1.9342922 -0.1773007 -0.7001778 debye
dipolederiv: -1.4001644 -0.2912757 0.0731347 -0.4322421 -0.6411569 0.0295066 0.0937197 0.0163644 -0.2959572 -0.6887417 0.1317791 0.0189717 -0.2304713 -0.8867962 0.0040149 0.0317253 -0.0284017 -0.3031908 -0.729266 -0.0065425 0.2417473 -0.0733018 -0.360815 -0.1119896 0.1478072 -0.1603821 -0.3511493 -0.1897332 0.0492116 -0.0583524 -0.0351399 -0.638866 -0.242546 -0.1233989 -0.0797905 -0.5392002 -0.4991523 -0.0926531 0.0549597 0.1009202 -0.5038414 -0.2414833 0.1865126 -0.2857153 -0.3399071 -0.1929432 0.0254798 -0.1094561 0.0614945 -0.4506452 0.0618003 -0.1203937 -0.0275818 -0.6656129 1.0255142 0.2709211 -0.3247896 0.1156185 0.7867813 0.4344171 -0.3330809 0.5949651 0.4770584 0.0129469 -0.1433144 0.1900453 -0.0394496 1.1886851 0.1053589 0.2532094 -0.0224296 1.0678814 -0.0174531 -0.0348976 0.0426889 0.0573262 -0.0789482 -0.0083469 0.00825 0.005351 0.0237284 0.4089401 -0.0729926 -0.0330755 -0.1643739 -0.1188079 -0.0384753 -0.0669555 -0.0697848 0.179993 -0.2805009 0.0683524 0.0470964 0.2251979 -0.051708 -0.0441183 0.1344846 -0.0436399 0.1301367 1.5630607 0.1227667 -0.112582 0.5302984 1.2535842 -0.0091033 -0.1702902 0.0321514 0.2134105 0.6534323 0.0409698 -0.0289333 -0.0739204 0.2080758 0.000781 -0.0277424 -0.0043453 0.2750788 0.0649889 -0.0104282 -0.0346859 0.0008224 0.0991219 -0.002352 -0.0169875 -0.0073178 -0.0128875 0.1360811 0.0328264 -0.0168559 -0.04492 0.0178085 0.0572014 0.0320193 0.0278811 0.0820124 0.0410098 -0.0251432 0.0221186 0.0005738 0.015333 -0.0190873 0.0002481 0.010503 0.0292676 0.0683358 0.0060185 -0.0051735 -0.0311982 -0.0057806 0.0554381 -0.0309951 0.0725749 0.0508903 0.0441963 0.0187059 0.0326908 -0.0199444 0.0924949 -0.0300394 -0.000716 -0.0397792 -0.0476176 -0.0054463 -0.003052 0.0091773 0.0946505 0.0451449 0.0946955 -0.0417079 0.0860154 -0.0407385 -0.0032003 -0.0169288 -0.0172458 0.0745546 0.0601717 -0.0990902 0.0374831 -0.0763208 -0.0572022 -0.0119046 -0.0698031 0.0085194 -0.1164953 -0.0298357 0.003418 0.0068091 -0.0003175 0.1240058 unknown
polarizability: 108.5057186|1.8267415|91.3000134|-3.4563889|9.4303701|74.0545455 unknown
InChI: InChI=1S/C5H8N2O6/c1-13-5(8)3-2-4(6(9)10)7(11)12/h4H,2-3H2,1H3
charge 0 multiplicity 1
21 atoms
O  -3.525032 -0.654269 -0.11023
O  -2.713032 1.530039 -0.127681
O  3.623149 0.746945 -0.696328
O  1.587738 -2.320014 -0.663061
O  2.281723 1.970328 0.695179
O  1.952435 -1.342894 1.375666
N  2.504887 1.015009 -0.124167
N  1.6713 -1.313352 0.126465
C  -0.013704 0.571531 0.015509
C  1.332633 0.068203 -0.491488
C  -1.161887 -0.38377 -0.375776
C  -2.513233 0.295798 -0.186051
C  -4.906293 -0.120715 0.02609
H  0.033369 0.707532 1.109325
H  -0.201204 1.569226 -0.419567
H  1.388565 -0.077915 -1.581389
H  -1.149368 -1.321177 0.206366
H  -1.089235 -0.680628 -1.441475
H  -5.148845 0.528367 -0.831555
H  -4.996729 0.458649 0.959693
H  -5.547736 -1.011994 0.046576
