program: Gaussian 09
title: 000029400
version: EM64L-G09RevD.01
frameworkgroup: C1[X(C20H20N2O)]
method: RPBEPBE
basis: SDD
operation: Freq
keyword: #p
keyword: freq=noraman
keyword: PBEPBE/SDD
title: #p freq=noraman PBEPBE/SDD
converged: YES YES NO NO
title: Mulliken charges:
elementType: O N N C C C C C C C C C C C C C C C C C C C C H H H H H H H H H H H H H H H H H H H H
charge: -0.146613 0.050023 -0.041639 0.237221 0.112980 -0.624647 -0.567660 -0.592886 -0.562663 -0.515355 0.048619 0.414985 0.411709 -0.390695 -0.415130 -0.344662 -0.414734 -0.262554 -0.243157 -0.267327 -0.252807 -0.240462 -0.239390 0.225030 0.260304 0.246352 0.250574 0.234156 0.258143 0.265842 0.255153 0.259864 0.266288 0.224442 0.248130 0.241570 0.248025 0.226791 0.226997 0.225514 0.223294 0.231755 0.228622
chargesum: 0.00000
title: Mulliken charges with hydrogens summed into heavy atoms:
elementType: O N N C C C C C C C C C C C C C C C C C C C C
charge: -0.146613 0.050023 -0.041639 0.237221 0.112980 -0.139313 -0.070734 -0.100586 -0.041668 0.010797 0.048619 0.414985 0.411709 -0.166254 -0.167000 -0.103092 -0.166710 -0.035763 -0.016160 -0.041814 -0.029513 -0.008707 -0.010769
polarizability: 2.90181143e+02 -5.17943760e+00 2.16013033e+02 7.07869914e+00 8.04701878e+00 1.53236709e+02
1716.lowfreq: -13.4972 -0.0004 -0.0003 0.0005 4.9140 15.2473 38.8748 50.9411 58.0887
frequency: 38.7946 50.9160 58.0758 68.3235 87.3078 127.2888 148.3536 232.4057 251.7563 260.3972 274.0407 281.2269 310.3254 325.1189 381.5253 391.7315 399.8335 405.3657 406.1687 426.5584 451.2602 485.3165 506.2108 526.6388 537.9548 588.7106 613.4413 616.4796 620.0313 626.4833 650.8161 703.5797 705.1064 710.1055 743.6414 751.4960 770.2648 786.8891 817.9477 831.7526 846.6979 850.1723 854.5995 873.5775 907.3837 908.8971 917.8865 933.7489 954.7216 969.7811 972.2788 974.8253 983.9406 989.9039 990.9497 994.5810 995.9754 1011.9361 1025.2286 1028.7439 1033.3364 1040.5541 1050.7173 1070.7811 1086.9346 1096.8205 1122.2032 1173.8025 1174.5203 1177.7172 1179.9992 1197.5452 1202.1195 1210.1524 1215.7693 1244.0896 1280.4705 1286.0970 1290.3995 1304.2414 1315.8239 1321.7225 1324.1776 1329.0645 1329.4728 1333.1933 1353.9736 1376.6239 1378.9081 1433.5502 1434.5286 1443.9184 1451.0619 1460.9709 1463.8509 1478.6857 1486.4686 1489.0108 1587.1536 1588.5602 1612.3823 1613.0921 1632.0635 2975.1910 2986.3856 2995.0830 3004.4812 3026.7762 3037.5777 3052.1057 3061.6530 3078.3625 3102.1336 3116.4941 3123.2098 3126.8210 3133.3214 3139.6513 3149.6455 3151.8599 3158.0920 3165.3054 3168.1301
redmass: 4.0287 5.2727 4.9463 5.5993 4.3789 4.2724 4.1752 5.4550 3.3697 3.9671 4.8940 2.8241 3.2318 4.3710 3.9799 3.9318 2.7729 2.8140 2.7802 4.3520 2.2743 2.0503 2.6829 3.6272 3.0284 5.1403 6.6369 6.3823 6.4489 4.7072 6.5919 1.6953 1.9060 3.3563 4.6802 2.2102 2.0861 4.2117 3.6718 3.9488 1.2852 1.3250 3.0891 3.6421 1.5997 1.6211 1.6001 2.1659 2.7034 1.8667 2.1177 1.4080 2.4393 4.6523 4.9557 1.5346 1.3228 3.3691 2.9577 3.0145 2.0768 2.7302 2.6826 2.4090 1.6526 1.7603 2.3119 1.2327 1.0531 1.7309 1.3314 1.1812 1.2215 3.1078 2.5974 3.1133 1.4460 1.2789 1.3164 1.2244 1.4141 1.3586 1.3787 1.3498 1.3508 1.3228 1.4638 5.9030 6.1097 2.2586 2.2446 1.0836 1.0892 1.1009 1.1083 1.1143 2.1111 2.0610 5.8157 5.8263 6.0162 6.0947 11.3540 1.0586 1.0601 1.0592 1.0592 1.0591 1.1035 1.1049 1.1054 1.1069 1.1096 1.0863 1.0846 1.0864 1.0885 1.0924 1.0927 1.0946 1.0947 1.1011 1.1002
irintensity: 0.1284 1.1474 0.2000 1.0735 0.9689 0.4146 1.2401 1.4241 1.4561 0.7711 0.3287 0.5221 1.7877 0.3832 4.9175 1.9561 1.1406 1.4815 0.3274 0.2962 1.5396 2.8589 8.4858 0.5443 8.6663 21.4770 1.5704 0.8683 9.3631 3.4327 5.1729 49.8154 19.4148 46.2219 77.4383 32.7953 22.3312 18.3686 5.5427 28.0109 1.9807 2.8474 42.4126 38.4583 2.5261 5.5450 6.2798 11.6118 47.4265 3.3728 23.7020 1.0928 24.2702 0.3656 4.5159 3.6996 0.2950 1.3525 15.3259 11.7980 34.4454 8.3445 37.4899 51.3368 3.5774 11.4874 16.0690 4.9145 0.0903 13.2243 10.5017 2.6725 8.7721 32.7584 1.1236 5.3079 2.3073 16.1836 12.1973 6.6835 2.7017 1.5651 0.3726 0.1505 1.8670 0.4982 0.6439 0.3785 0.1706 4.6810 11.3117 16.9865 10.4511 14.0619 24.8213 0.9827 25.8521 25.4643 2.9751 1.1865 21.5147 10.6290 260.5437 28.9060 38.2086 49.0062 25.4068 48.3285 9.6884 13.9352 18.8618 14.9403 15.0395 12.6617 1.4771 0.0312 8.0108 24.0576 38.3721 32.8877 28.9843 19.7641 8.8769
temp: 298.150 k
press: 1.00000 atm
elementType: 8 7 7 6 6 6 6 6 6 6 6 6 6 6 6 6 6 6 6 6 6 6 6 1 1 1 1 1 1 1 1 1 1 1 1 1 1 1 1 1 1 1 1
symmnumber: 1
zpe: 929404.4 jmol-1
zpe.correction: 0.353991 hartree
zpe.thermalcorrener: 0.371548 hartree
zpe.thermalcorrenthalpy: 0.372493 hartree
zpe.thermalcorrgfe: 0.308714 hartree
zpe.sumelectzpe: -957.189600 hartree
zpe.sumelectthermal: -957.172043 hartree
zpe.sumelectthermalent: -957.171099 hartree
zpe.sumelectthermalfe: -957.234877 hartree
dipole: -2.9451 2.1873 2.2776
dipole: 4.3181
quadrupole: -126.0656 -132.6398 -142.9008
quadrupole: 3.6837 9.2833 -3.0943
quadrupole: 7.8032 1.2289 -9.0321 3.6837 9.2833 -3.0943
hfenergy: -957.5435912 hartree
pointgroup: C01 [X(C20H20N2O1)]
dipole: 1.1563186 -0.8378549 0.9203491 debye
polarizability: 289.9817796|-6.2120014|215.443157|-7.7987606|-10.2409866|154.0059489 unknown
InChI: InChI=1S/C20H20N2O/c23-18-20(17-9-5-2-6-10-17)11-19(16-7-3-1-4-8-16)12-21(14-20)15-22(18)13-19/h1-10H,11-15H2
charge 0 multiplicity 1
43 atoms
O  -2.238356 1.908353 -1.604779
N  0.025407 1.993372 1.573016
N  -0.032279 2.371193 -0.870936
C  1.375477 0.48638 0.06062
C  -1.209813 0.345002 0.041761
C  0.131324 -0.443785 -0.080298
C  1.292156 1.216574 1.451406
C  1.235613 1.585378 -1.031673
C  -1.144489 1.097629 1.473491
C  -0.044191 3.020003 0.503599
C  -1.240826 1.536479 -0.949571
C  2.676282 -0.318991 -0.0389
C  -2.448249 -0.550347 -0.005715
C  2.922698 -1.376622 0.880387
C  3.671836 -0.043463 -1.013035
C  -3.744408 0.022313 0.121431
C  -2.35567 -1.961323 -0.132292
C  4.114716 -2.128866 0.830362
C  4.867076 -0.797104 -1.068312
C  -4.900038 -0.785496 0.130938
C  -3.513125 -2.773117 -0.126223
C  5.095868 -1.842521 -0.147421
C  -4.79168 -2.190346 0.009021
H  0.154726 -1.214824 0.714199
H  0.182939 -0.974964 -1.050033
H  1.33814 0.483375 2.276999
H  2.147562 1.908089 1.56534
H  2.069111 2.312027 -0.975862
H  1.242353 1.143375 -2.044459
H  -2.068817 1.680732 1.62825
H  -1.08881 0.317949 2.254897
H  0.823602 3.696963 0.574137
H  -0.97628 3.599704 0.604891
H  2.176413 -1.620167 1.646389
H  3.525861 0.75866 -1.743105
H  -3.856157 1.109123 0.183872
H  -1.381147 -2.445739 -0.24462
H  4.278913 -2.937783 1.551249
H  5.618291 -0.565881 -1.832124
H  -5.886613 -0.317878 0.224892
H  -3.412796 -3.859762 -0.228768
H  6.022123 -2.425997 -0.190332
H  -5.689642 -2.818298 0.014411
