program: Gaussian 09
title: 000029348
version: EM64L-G09RevD.01
frameworkgroup: C1[X(C14H25NO)]
method: RPBEPBE
basis: SDD
operation: Freq
keyword: #p
keyword: freq=noraman
keyword: PBEPBE/SDD
title: #p freq=noraman PBEPBE/SDD
converged: YES YES NO NO
title: Mulliken charges:
elementType: O N C C C C C C C C C C C C C C H H H H H H H H H H H H H H H H H H H H H H H H H
charge: -0.296756 -0.109776 -0.162421 -0.161473 -0.001017 -0.073833 -0.532142 -0.485319 -0.490871 -0.554647 -0.782762 -0.659290 0.256810 -0.498070 -0.354512 -0.692013 0.231501 0.227122 0.211379 0.205795 0.224717 0.217390 0.267348 0.212382 0.222433 0.208086 0.271006 0.222990 0.217740 0.219260 0.210743 0.237194 0.233072 0.243450 0.222840 0.219955 0.214123 0.227191 0.222660 0.203987 0.203729
chargesum: 0.00000
title: Mulliken charges with hydrogens summed into heavy atoms:
elementType: O N C C C C C C C C C C C C C C
charge: -0.296756 -0.109776 0.069080 0.065649 0.210362 0.131962 -0.090035 -0.005588 -0.060353 -0.060652 -0.135018 0.054426 0.256810 -0.055276 0.086802 -0.061637
polarizability: 1.82930792e+02 7.06841298e+00 1.50670987e+02 -2.56813751e+00 4.90753720e+00 1.28999542e+02
1716.lowfreq: -8.9938 -0.0009 -0.0007 -0.0004 8.5587 18.8569 29.2797 34.6513 63.7185
frequency: 29.1393 34.5847 63.7115 71.4032 85.4857 100.1040 101.8127 149.8664 165.1225 171.9113 222.9071 233.2896 237.4349 267.8109 285.1123 312.3978 324.4308 360.8485 403.6955 413.1670 458.2782 509.8318 523.5952 550.2659 579.1206 620.7614 724.1835 738.0327 742.5799 784.5746 789.0276 805.8153 840.3662 875.4351 880.2300 894.7598 901.6925 925.6253 928.2692 946.9193 963.7338 975.1389 997.9612 1009.4374 1042.0527 1054.0932 1059.6902 1076.6545 1079.8608 1089.1251 1092.9003 1105.3297 1115.3522 1124.6146 1126.3688 1160.0180 1168.7331 1181.7467 1200.1888 1220.3001 1221.2231 1246.6320 1250.0373 1258.5177 1266.5931 1277.4060 1284.5275 1290.1206 1294.5291 1310.8813 1313.5173 1338.3522 1343.7091 1346.9144 1358.7110 1383.8753 1389.9077 1393.4346 1441.7405 1448.0193 1456.1197 1469.5249 1470.6189 1473.5918 1476.4143 1478.6797 1479.9141 1483.3788 1485.0064 1492.0014 1504.6742 1580.8235 2942.5598 2955.0730 2957.9606 2962.9956 2963.9322 2968.8736 2969.5241 2990.8626 2999.8654 3005.9832 3008.6913 3010.7055 3041.3475 3046.4772 3046.8000 3047.9337 3053.4970 3055.8514 3062.2453 3067.2988 3071.9044 3076.1548 3079.2684 3080.8060 3096.4518
redmass: 3.2380 3.9392 3.1662 1.8405 2.6037 1.9782 1.9360 2.1975 2.7680 3.1522 1.1605 1.1561 2.1119 3.0303 2.3482 3.7540 2.3791 2.9650 2.7619 2.3270 2.0959 2.7890 3.1903 2.9259 3.7333 3.7856 3.3022 3.3858 1.1744 4.4689 2.6079 1.5300 1.8758 1.3634 2.5530 2.1297 2.1364 1.9892 2.6851 2.1741 1.6464 1.8102 1.4680 1.7189 1.5434 2.4705 1.9295 1.3911 1.7421 1.5301 1.7555 1.4322 1.8054 1.3732 1.9539 1.9136 1.6835 1.7117 1.9587 1.3937 1.3767 1.6148 1.9396 1.4185 1.3409 1.4583 1.3482 1.1415 1.4764 1.5170 1.5033 1.5398 1.3392 1.5818 1.4233 1.2139 1.3968 1.9457 1.1001 1.2015 1.1169 1.0735 1.0574 1.0579 1.0614 1.0431 1.0484 1.0822 1.0735 1.1018 1.0913 6.9465 1.0816 1.0604 1.0510 1.0523 1.0470 1.0368 1.0817 1.0599 1.0596 1.0939 1.0658 1.0657 1.0877 1.0940 1.0978 1.1017 1.0960 1.0943 1.0998 1.1045 1.0984 1.0950 1.1025 1.0997 1.0989
irintensity: 0.1114 1.4490 3.5769 1.2761 0.1375 0.1609 1.7411 2.3018 3.2970 0.2626 0.1760 0.1630 1.2939 3.9699 2.2477 6.6956 0.4094 0.3862 5.9624 2.6606 0.1050 3.4622 2.1975 0.2024 5.9727 5.6633 0.2780 0.8504 13.2806 2.7836 1.0351 1.0558 3.7984 0.5724 1.7595 9.9167 3.5955 1.4383 4.7961 11.8955 2.4713 14.0551 0.4543 1.4313 2.7603 3.2582 7.6087 1.3505 19.0907 1.2546 19.7566 5.6481 0.5458 1.8349 14.3808 38.1638 7.0032 12.8704 7.2529 0.0149 0.8241 11.0888 38.4740 0.5723 1.0859 31.4337 4.3211 2.1540 1.4216 6.2793 3.6776 20.8640 1.5767 2.9445 2.8383 16.1630 45.4230 43.8237 27.8131 6.8783 12.0773 1.2392 5.8353 9.9922 3.7718 10.4167 21.1211 27.5512 11.5078 34.2970 11.9604 205.9787 11.4720 18.5210 33.2539 8.2777 104.1084 47.5183 41.1664 36.8242 39.8055 14.1638 43.2172 18.2770 85.8949 15.8284 21.3332 9.1104 10.1359 75.8012 44.8109 35.9436 49.7832 26.7061 69.7207 31.2069 23.8461
temp: 298.150 k
press: 1.00000 atm
elementType: 8 7 6 6 6 6 6 6 6 6 6 6 6 6 6 6 1 1 1 1 1 1 1 1 1 1 1 1 1 1 1 1 1 1 1 1 1 1 1 1 1
symmnumber: 1
zpe: 961614.3 jmol-1
zpe.correction: 0.366260 hartree
zpe.thermalcorrener: 0.383695 hartree
zpe.thermalcorrenthalpy: 0.384639 hartree
zpe.thermalcorrgfe: 0.320264 hartree
zpe.sumelectzpe: -677.182569 hartree
zpe.sumelectthermal: -677.165134 hartree
zpe.sumelectthermalent: -677.164190 hartree
zpe.sumelectthermalfe: -677.228565 hartree
dipole: 0.3883 3.0830 2.1835
dipole: 3.7978
quadrupole: -97.5481 -97.3620 -102.4382
quadrupole: -4.7162 -4.6345 -2.1756
quadrupole: 1.5680 1.7541 -3.3221 -4.7162 -4.6345 -2.1756
hfenergy: -677.548829 hartree
pointgroup: C01 [X(C14H25N1O1)]
dipole: -0.1674302 1.1895486 -0.8885177 debye
polarizability: 182.7953651|-7.2967596|150.4160057|-3.3978046|-5.3446791|129.3899505 unknown
InChI: InChI=1S/C14H25NO/c1-4-5-14(16)15(3)9-13-10(2)11-6-7-12(13)8-11/h10-13H,4-9H2,1-3H3
charge 0 multiplicity 1
41 atoms
O  1.824302 -0.756594 1.269518
N  1.041698 1.162704 0.205595
C  -1.309588 -0.667648 -0.949762
C  -3.404635 -0.76215 -0.049052
C  -1.422382 0.682407 -0.170029
C  -2.839963 0.581783 0.525656
C  -2.77087 -0.805676 -1.47167
C  -1.218657 -1.87509 0.031794
C  -2.664878 -1.94154 0.651414
C  -0.294931 1.016216 0.830287
C  -3.737642 1.804982 0.248475
C  1.224005 2.287632 -0.725377
C  2.028542 0.212878 0.467833
C  3.378182 0.392517 -0.247371
C  4.330379 -0.797625 -0.012585
C  5.702492 -0.582391 -0.685002
H  -0.517656 -0.665271 -1.718362
H  -4.505291 -0.82866 -0.000054
H  -1.471023 1.497467 -0.924901
H  -2.711935 0.483801 1.623828
H  -2.954866 -1.760018 -1.997805
H  -3.0868 0.028699 -2.124625
H  -0.420165 -1.753346 0.782508
H  -0.989724 -2.797228 -0.533815
H  -3.155334 -2.905471 0.421012
H  -2.660646 -1.825998 1.751068
H  -0.20191 0.227445 1.59492
H  -0.544504 1.965962 1.348867
H  -3.966114 1.897235 -0.830414
H  -4.698836 1.730114 0.791066
H  -3.245156 2.744235 0.566662
H  0.57294 3.122779 -0.410786
H  0.958114 2.023023 -1.768961
H  2.263855 2.651172 -0.71498
H  3.212209 0.533489 -1.334854
H  3.861162 1.326099 0.111987
H  3.856369 -1.72094 -0.394087
H  4.451259 -0.951447 1.074646
H  6.370423 -1.445124 -0.508647
H  6.206852 0.319221 -0.287253
H  5.601426 -0.454541 -1.780047
