program: Gaussian 09
title: 000029330
version: EM64L-G09RevD.01
frameworkgroup: C1[X(C11H20ClN3O4P2S4)]
method: RPBEPBE
basis: SDD
operation: Freq
keyword: #p
keyword: freq=noraman
keyword: PBEPBE/SDD
title: #p freq=noraman PBEPBE/SDD
converged: YES YES NO NO
title: Mulliken charges:
elementType: Cl S S S S P P O O O O N N N C C C C C C C C C C C H H H H H H H H H H H H H H H H H H H H
charge: 0.042778 0.096440 0.095309 -0.203239 -0.163823 0.659549 0.682109 -0.457909 -0.445360 -0.446018 -0.500966 0.096597 0.118761 0.115966 -0.220367 -0.206247 -0.208424 -0.221511 -0.288214 -0.274786 -0.648857 -0.659935 -0.654501 -0.650562 -0.275065 0.231024 0.236646 0.226448 0.241667 0.241702 0.225379 0.237593 0.226241 0.238298 0.236794 0.213075 0.233877 0.248412 0.209107 0.237392 0.241415 0.210084 0.234567 0.232668 0.215887
chargesum: 0.00000
title: Mulliken charges with hydrogens summed into heavy atoms:
elementType: Cl S S S S P P O O O O N N N C C C C C C C C C C C
charge: 0.042778 0.096440 0.095309 -0.203239 -0.163823 0.659549 0.682109 -0.457909 -0.445360 -0.446018 -0.500966 0.096597 0.118761 0.115966 0.247302 0.261869 0.258658 0.242322 -0.288214 -0.274786 0.039309 0.031461 0.034390 0.032560 -0.275065
polarizability: 4.23456262e+02 1.24894138e+01 3.06226203e+02 1.56571741e+01 1.42897382e+01 2.56981497e+02
1716.lowfreq: -11.6924 -7.5348 -4.1613 -0.0026 -0.0024 -0.0011 2.5850 5.2591 15.1717
frequency: -8.2726 2.4053 14.7988 22.4696 28.8816 36.0299 38.2148 40.6872 46.6243 51.9301 54.1776 55.8510 60.7186 72.6602 80.9435 92.1039 112.0888 117.2310 117.8795 122.1934 135.9961 149.3889 157.6940 163.4492 174.8572 183.6481 194.0352 230.3572 233.8749 238.9182 241.5479 250.9812 255.1872 259.3345 276.1939 288.9234 294.0547 314.1480 325.9774 367.6782 377.0931 386.3322 410.6552 424.8689 434.8077 437.6606 480.2164 535.1294 561.0873 617.9686 623.2164 676.2859 684.2130 691.6997 715.2988 773.9597 782.2611 792.3980 808.4741 811.5515 811.7199 813.6528 866.7384 870.4039 871.8960 885.9712 890.1205 1006.1151 1010.8956 1018.7696 1021.4807 1103.1295 1103.1684 1103.9747 1108.7052 1126.2483 1129.8150 1133.3924 1133.5906 1149.8856 1177.1209 1193.2354 1224.2380 1246.0457 1258.0286 1258.3611 1260.5686 1344.4120 1353.5497 1357.0523 1357.1078 1380.2712 1395.1713 1395.5587 1396.2539 1396.5334 1409.4521 1455.5674 1455.6560 1456.6383 1458.5086 1466.3876 1474.8066 1476.2297 1477.1460 1482.2102 1486.2404 1486.5972 1488.0569 2990.7841 2991.5958 2991.8998 2994.6017 2996.5659 2997.4644 2998.8834 2998.9048 3058.3756 3058.3868 3061.3892 3069.3965 3093.4245 3093.6155 3093.9405 3095.0523 3112.0313 3112.1542 3114.8116 3116.4620
redmass: 5.4220 5.4564 5.1041 6.6858 4.6474 3.3251 5.2613 4.3357 3.4383 2.6052 1.8580 2.0416 4.2925 4.5527 1.9357 4.6990 6.2522 10.1742 10.6130 7.9106 14.0334 10.0547 10.0114 11.7237 6.4845 6.6269 5.0675 1.6353 1.5264 1.7401 1.4700 2.0078 2.0747 3.8181 5.7142 4.9137 4.6966 5.8823 6.9708 14.1907 7.7040 9.8492 6.0119 12.4664 7.0324 15.5398 14.6473 12.1416 9.2383 12.3314 12.3371 6.7296 5.9379 7.8726 7.5709 13.5421 13.5898 12.7100 1.0927 1.0916 1.0980 1.0920 5.0763 4.5888 4.1321 13.6334 3.7925 2.3357 2.3062 2.6071 2.8007 2.2471 2.2399 2.2584 2.2204 1.3901 1.4201 1.4251 1.4259 12.5844 12.4341 12.4811 11.7344 1.1636 1.1361 1.1390 1.1425 1.2609 1.2555 1.2555 1.2488 12.2085 1.2403 1.2360 1.2406 1.2366 12.2964 1.0393 1.0388 1.0394 1.0400 1.0819 1.0569 1.0545 1.0571 1.0548 1.0728 1.0761 1.0764 1.0538 1.0537 1.0533 1.0486 1.0387 1.0396 1.0434 1.0412 1.1086 1.1080 1.1079 1.1060 1.0980 1.0980 1.0975 1.0979 1.1024 1.1026 1.1024 1.1025
irintensity: 0.2814 0.1035 0.4321 0.0759 1.3564 0.1368 0.6390 0.2790 0.2534 1.5342 1.1660 3.3853 2.2002 1.6592 5.0315 0.8328 3.6449 2.2813 0.3313 1.1902 0.9058 3.3165 0.7391 0.2456 2.5957 2.3904 0.4168 1.6074 4.9318 3.3454 0.5569 1.2752 3.9038 3.1022 31.6378 7.4291 20.3925 20.8538 12.0931 14.8385 208.6563 86.3354 2.9071 8.4320 7.8062 3.2739 2.4104 209.2468 116.4837 0.7817 2.8975 57.1503 33.7026 66.9210 57.9864 216.2373 151.0371 4.7695 2.3888 1.7599 9.6782 4.4456 263.0197 240.4984 131.9666 2.1139 25.0962 110.9006 178.1164 124.2280 17.7146 16.2484 5.1569 18.6400 2.8199 8.6846 2.7976 5.9345 3.9942 157.8861 198.7947 308.0757 10.3450 1.2697 0.4978 0.1871 0.3644 11.2349 10.2224 12.6333 3.5251 596.1106 25.5253 26.9491 26.5129 21.8738 1129.5788 17.2468 6.0546 14.4859 15.2849 19.3930 8.0680 8.3660 3.9774 7.6909 13.5793 12.8246 10.4107 17.5731 25.1473 19.2647 12.3329 21.2300 25.8556 42.0541 0.7729 7.6493 10.1533 11.4685 11.9094 15.6775 23.4632 24.8282 21.8866 33.0507 28.0892 27.2938 30.8784
temp: 298.150 k
press: 1.00000 atm
elementType: 17 16 16 16 16 15 15 8 8 8 8 7 7 7 6 6 6 6 6 6 6 6 6 6 6 1 1 1 1 1 1 1 1 1 1 1 1 1 1 1 1 1 1 1 1
symmnumber: 1
zpe: 832575.4 jmol-1
zpe.correction: 0.317111 hartree
zpe.thermalcorrener: 0.350248 hartree
zpe.thermalcorrenthalpy: 0.351192 hartree
zpe.thermalcorrgfe: 0.243444 hartree
zpe.sumelectzpe: -3629.087510 hartree
zpe.sumelectthermal: -3629.054374 hartree
zpe.sumelectthermalent: -3629.053430 hartree
zpe.sumelectthermalfe: -3629.161177 hartree
dipole: 3.2252 -4.3773 -1.1206
dipole: 5.5514
quadrupole: -200.7502 -201.5769 -184.6540
quadrupole: -13.5696 -17.9023 -0.1446
quadrupole: -5.0898 -5.9166 11.0064 -13.5696 -17.9023 -0.1446
hfenergy: -3629.4046215 hartree
pointgroup: C01 [X(C11H20Cl1N3O4P2S4)]
dipole: 1.3545831 -1.643712 -0.4832981 debye
polarizability: 420.4595781|14.7262839|305.1338581|24.0373777|18.7052905|261.0705257 unknown
InChI: InChI=1S/2C4H10O2PS.C3ClN3S2/c2*1-3-5-7(8)6-4-2;4-1-5-2(8)7-3(9)6-1/h2*3-4H2,1-2H3;
charge 0 multiplicity 1
45 atoms
Cl 0.824236 4.5376 0.758233
S  -3.326725 1.574669 -0.963041
S  1.587353 -0.703631 -0.393883
S  -5.992552 -0.821129 -0.773436
S  3.130361 0.726571 2.824141
P  -4.028717 -0.57595 -0.198411
P  3.445055 0.054283 0.919012
O  -3.626495 -0.547254 1.476593
O  -2.854151 -1.751951 -0.616761
O  4.360434 1.083102 -0.098027
O  4.300402 -1.448113 0.707041
N  -0.785139 0.566293 -0.634074
N  1.061637 1.925061 0.161434
N  -1.14734 2.891271 -0.045993
C  -4.58212 0.117351 2.419319
C  -2.51259 -1.94916 -2.059912
C  4.749576 0.63653 -1.476971
C  4.197135 -2.498002 1.765949
C  -1.578175 1.666539 -0.49089
C  0.5165 0.74177 -0.265702
C  -4.01874 -0.131336 3.814124
C  -1.539463 -3.122158 -2.088312
C  5.446561 1.835551 -2.109833
C  5.115343 -3.632012 1.321658
C  0.174551 2.943078 0.233478
H  -4.626705 1.196157 2.176788
H  -5.585014 -0.329675 2.285121
H  -3.44117 -2.158221 -2.62523
H  -2.041773 -1.018893 -2.426883
H  5.411493 -0.242487 -1.383972
H  3.831836 0.34969 -2.025513
H  4.508857 -2.060012 2.732193
H  3.14314 -2.827087 1.842215
H  -3.009105 0.300952 3.913533
H  -3.962077 -1.211979 4.026056
H  -4.676969 0.341096 4.566518
H  -2.006849 -4.032558 -1.677086
H  -0.638631 -2.885936 -1.497341
H  -1.234251 -3.323489 -3.13192
H  6.339589 2.120886 -1.529268
H  4.766855 2.702335 -2.157839
H  5.764286 1.577285 -3.137255
H  6.15723 -3.280552 1.235186
H  4.796562 -4.038021 0.34691
H  5.081559 -4.447566 2.067451
