program: Gaussian 09
title: 000029305
version: EM64L-G09RevD.01
frameworkgroup: C1[X(C8H7N3O2)]
method: RPBEPBE
basis: SDD
operation: Freq
keyword: #pfreq=noraman
keyword: PBEPBE/SDD
title: #p freq=noraman PBEPBE/SDD
converged: NO YES NO NO
title: Mulliken charges:
elementType: O O N N N C C C C C C C C H H H H H H H
charge: -0.261278 -0.245946 -0.442274 -0.351818 -0.339866 0.150111 0.360984 0.154580 -0.321083 -0.388648 0.153224 -0.252002 -0.202515 0.328932 0.269840 0.231641 0.337864 0.238078 0.235693 0.344482
chargesum: 0.00000
title: Mulliken charges with hydrogens summed into heavy atoms:
elementType: O O N N N C C C C C C C C
charge: -0.261278 -0.245946 -0.113342 -0.013954 0.004617 0.150111 0.360984 0.154580 -0.051242 -0.157007 0.153224 -0.013924 0.033178
polarizability: 1.54625562e+02 -3.47581717e+00 1.28100062e+02 -2.39512687e+00 4.30309739e+00 5.48193579e+01
1716.lowfreq: -9.9725 0.0007 0.0007 0.0007 4.9282 7.0979 82.1898 91.0395 128.3487
frequency: 82.1868 91.0356 128.3463 204.5838 246.0363 282.4151 350.5937 376.4616 397.6264 431.4371 472.5086 512.3822 537.4738 553.6537 562.1611 600.7145 666.9179 690.8517 698.3509 721.7638 759.4573 773.9457 782.2515 863.5076 877.6565 930.5020 961.3596 990.6269 1042.9823 1075.5320 1119.4731 1177.1660 1190.5857 1244.4699 1266.0317 1304.4650 1372.5289 1382.9231 1403.3955 1432.1861 1451.3620 1459.6494 1487.2269 1580.4696 1607.4846 1619.2998 1665.2104 3124.8126 3145.2959 3157.3635 3174.9260 3495.3660 3528.4718 3553.6314
redmass: 8.4001 5.6918 4.9939 7.4286 4.4575 5.3718 5.6704 7.8014 7.7532 3.8218 1.2321 2.4677 4.2772 2.5086 2.1682 3.0029 4.5758 3.7737 2.4570 5.4020 3.9216 2.1979 2.3761 3.0679 1.8575 5.1138 1.3870 1.3465 2.6378 3.7993 1.9082 1.0842 2.2538 2.5704 1.5588 4.4863 3.1241 2.8346 2.0598 2.0393 1.8774 2.2145 2.5063 6.8800 5.6026 6.3876 4.3535 1.0881 1.0890 1.0936 1.1004 1.0777 1.0754 1.0780
irintensity: 4.8103 0.9551 0.5099 3.4068 2.0168 3.7882 1.8233 2.7998 15.1135 22.6883 93.4539 8.6747 50.9907 54.0378 51.4135 28.2611 10.7503 62.0961 49.8113 9.3370 16.0356 101.3643 35.6861 2.8486 0.5483 6.3892 4.7647 0.4224 10.8414 9.3057 54.6520 1.4856 64.2974 49.9683 1.9649 21.5417 125.0883 95.3227 31.8338 148.8224 61.4653 69.8861 12.1552 5.6908 173.0874 114.2425 516.4729 6.9973 8.0091 8.0762 17.1866 25.3060 34.2093 37.5347
temp: 298.150 k
press: 1.00000 atm
elementType: 8 8 7 7 7 6 6 6 6 6 6 6 6 1 1 1 1 1 1 1
symmnumber: 1
zpe: 386448.3 jmol-1
zpe.correction: 0.147190 hartree
zpe.thermalcorrener: 0.157372 hartree
zpe.thermalcorrenthalpy: 0.158317 hartree
zpe.thermalcorrgfe: 0.111372 hartree
zpe.sumelectzpe: -622.837831 hartree
zpe.sumelectthermal: -622.827649 hartree
zpe.sumelectthermalent: -622.826705 hartree
zpe.sumelectthermalfe: -622.873649 hartree
dipole: -1.0646 -1.4339 0.5691
dipole: 1.8744
quadrupole: -70.9382 -79.2167 -74.8270
quadrupole: 15.6374 -1.4970 6.9558
quadrupole: 4.0558 -4.2228 0.1670 15.6374 -1.4970 6.9558
hfenergy: -622.9850213 hartree
pointgroup: C01 [X(C8H7N3O2)]
dipole: 0.4299427 -0.5543037 -0.2274707 debye
dipolederiv: -0.6503483 -0.0647433 -0.0622944 -0.1588371 -1.1391236 -0.1764389 -0.1451859 -0.2181175 -0.4198111 -1.2451627 -0.3666686 -0.1059777 -0.5145961 -0.8543175 -0.0329402 -0.1731152 -0.0732159 -0.3823185 -1.5948023 -0.1974806 -0.1034727 0.0429812 -0.249044 -0.0788046 -0.314772 0.0281218 -0.5099816 -0.6849249 -0.0143043 -0.2110342 0.0895026 -0.1408909 0.292526 -0.0896885 0.2095715 -0.2787206 -0.3918329 0.0253985 0.2379705 0.0802008 -0.6059569 0.0825161 0.1285888 0.2410899 -0.2127108 -0.3431578 0.2870766 0.0076583 0.0223151 -0.4012403 -0.0280373 0.1099944 -0.0188595 -0.0351136 1.0707621 0.3112639 -0.1626191 0.2682511 0.228745 0.0545913 -0.1963025 -0.0038852 0.0991154 1.461219 -0.0638626 0.2016148 -0.0243845 1.3002107 0.2186155 0.1633981 0.2203345 0.2832092 0.1052771 -0.1821292 -0.0228514 0.0800507 0.0993241 -0.0560221 -0.0066215 -0.0125881 -0.0988918 -0.4711135 -0.0607707 0.0103352 0.1672671 0.0691956 -0.0739827 -0.0116975 -0.0481315 -0.1567173 1.9522686 0.3225942 0.3418466 0.1009259 1.3653838 -0.2022867 0.6293992 -0.2582023 0.4881433 0.023556 0.1009058 -0.0642871 0.020804 -0.2702467 -0.0096028 -0.0419939 -0.0143108 -0.1624265 0.1661545 0.0286884 -0.0462149 -0.0064868 0.1704468 -0.0411487 -0.0801115 -0.0586319 -0.103356 0.1305709 0.0187507 -0.0382948 0.013465 0.1686472 0.05667 -0.0235224 0.014708 0.3072806 0.1092363 -0.0037825 0.0106149 -0.053107 0.0011297 0.0411876 -0.0085091 0.0251771 0.1475694 0.0575248 -0.0818588 0.0416785 -0.0401907 -0.0740189 0.0436532 0.0330254 0.0520974 0.1518447 0.1410615 -0.0482681 -0.0059848 -0.0706967 0.1330144 -0.1061906 0.0568929 -0.1416286 0.3138828 -0.0899294 -0.0283987 0.0567769 -0.0392256 0.0800698 0.0219161 0.061644 0.02789 0.1515061 -0.0082793 0.1017727 0.0091075 0.1128161 -0.0061912 0.0099839 0.0147273 0.0178081 0.1490903 0.2619204 -0.0841835 -0.0945722 -0.0910551 0.1248631 -0.0162052 -0.10615 0.0107729 0.268406 unknown
polarizability: 154.5428225|3.9580027|128.3227181|-1.322929|-3.2897083|54.6794413 unknown
InChI: InChI=1S/C8H7N3O2/c12-7-5-3-1-2-4-6(5)9-8(13)11-10-7/h1-4,9-11H
charge 0 multiplicity 1
20 atoms
O  0.181252 2.875476 0.537752
O  -3.112699 -1.702779 -0.300761
N  -0.993741 -1.215905 0.579351
N  -1.599165 1.519534 0.01548
N  -2.181394 0.418145 -0.631264
C  0.684365 0.56986 -0.04043
C  0.328737 -0.782741 0.249205
C  -0.229838 1.738339 0.157224
C  2.034852 0.87596 -0.355247
C  1.344767 -1.778292 0.248445
C  -2.17663 -0.879757 -0.109113
C  3.027452 -0.11866 -0.384325
C  2.677132 -1.45323 -0.064651
H  -1.0562 -2.141265 1.012996
H  2.284542 1.925806 -0.53913
H  1.076961 -2.817161 0.47665
H  -2.227773 2.219464 0.423219
H  4.061532 0.138697 -0.633111
H  3.438768 -2.240272 -0.066062
H  -2.85232 0.617881 -1.374928
