program: Gaussian 09
title: 000029327
version: EM64L-G09RevD.01
frameworkgroup: C1[X(C8H15N3O7)]
method: RPBEPBE
basis: SDD
operation: Freq
keyword: #p
keyword: freq=noraman
keyword: PBEPBE/SDD
title: #p freq=noraman PBEPBE/SDD
converged: YES YES NO NO
title: Mulliken charges:
elementType: O O O O O O O N N N C C C C C C C C H H H H H H H H H H H H H H H
charge: -0.272721 -0.486490 -0.462240 -0.461342 -0.435630 -0.326192 -0.226033 -0.402443 -0.164880 0.047908 -0.128032 -0.157102 -0.085456 -0.035512 -0.163308 -0.374749 0.376504 -0.622727 0.245440 0.292703 0.215024 0.262744 0.249435 0.192281 0.255718 0.387430 0.385025 0.372442 0.377596 0.345547 0.278908 0.259755 0.260398
chargesum: 0.00000
title: Mulliken charges with hydrogens summed into heavy atoms:
elementType: O O O O O O O N N N C C C C C C C C
charge: -0.272721 -0.101465 -0.089798 -0.083747 -0.090083 -0.326192 -0.226033 -0.015013 -0.164880 0.047908 0.117408 0.135602 0.129568 0.227232 0.086127 0.073250 0.376504 0.176334
polarizability: 1.79856922e+02 7.86422204e+00 1.38182567e+02 2.44762668e+00 7.29156383e+00 9.24647343e+01
1716.lowfreq: -8.4439 -0.0007 -0.0007 0.0002 2.4919 7.7320 19.8561 37.8006 65.5564
frequency: 19.1917 37.7918 65.5540 72.6909 96.0796 106.2356 113.8772 126.8826 132.7442 178.5329 187.1414 208.6523 232.5416 257.0808 276.3122 303.5075 318.6659 349.3389 351.1749 361.5883 383.3289 392.8964 410.9503 445.6493 461.8665 475.6035 483.3610 514.0699 547.0030 566.5534 597.4334 626.8001 711.3187 729.5202 739.8395 766.3494 787.0037 823.0005 863.5786 923.9735 959.6565 980.8384 990.4197 1004.7244 1009.6597 1044.5200 1054.1511 1065.9709 1082.0999 1092.5557 1116.6780 1117.3118 1154.5475 1180.1062 1191.2614 1199.0590 1217.3044 1246.7750 1274.0893 1274.4743 1286.8819 1307.9693 1319.9718 1326.2456 1337.7428 1342.0315 1350.4722 1372.4781 1375.5068 1382.8287 1402.4031 1414.4650 1420.4139 1460.6885 1461.8717 1469.1210 1494.9232 1620.8873 2952.7372 2968.4308 2988.7279 3008.5776 3013.2944 3027.0464 3032.5181 3094.7205 3112.1230 3151.2187 3287.7667 3466.2743 3531.0382 3550.8695 3581.0533
redmass: 6.6030 8.0941 4.8203 6.1024 5.6983 5.1491 5.8958 1.1814 4.5133 3.8552 4.6032 7.2988 6.1126 5.3160 4.5507 4.2349 4.9144 3.3829 3.7139 3.0587 5.3096 1.7736 3.5519 1.5360 2.5921 1.6527 3.4549 3.8501 2.8180 2.7918 2.5534 1.8735 6.4785 5.3853 1.3387 3.9117 2.9589 5.4368 3.5562 3.2960 4.4383 3.0461 5.3219 5.3964 3.6114 4.6221 3.2472 2.6447 3.3899 3.0645 1.3264 2.2380 2.5516 1.2525 1.3419 2.0411 1.2969 1.1908 1.7599 1.2124 1.2313 1.4429 1.4963 1.2336 1.1966 1.3200 1.2127 6.0013 1.4359 1.3408 1.8231 1.2048 1.4363 1.0812 1.0430 1.1385 2.0500 9.2330 1.0818 1.0695 1.0844 1.0336 1.0846 1.0871 1.0849 1.1012 1.0943 1.1012 1.0699 1.0776 1.0653 1.0655 1.0662
irintensity: 0.5133 2.5726 0.7653 4.7719 2.9248 1.2993 4.4178 0.0543 3.5954 3.5882 3.3456 15.1838 3.7940 4.8683 4.0663 2.7451 19.2892 5.4204 10.9294 56.0657 10.3075 136.9148 45.7735 68.7193 77.4170 125.2085 39.7922 16.1807 69.6178 48.1760 8.9373 56.3525 11.8182 38.4595 92.6203 37.1992 58.8667 19.8335 25.5707 414.4009 86.6069 36.4475 12.2145 12.6587 15.5761 46.0657 50.3701 140.8591 113.7956 48.4787 0.5169 7.6953 36.3332 39.6520 15.1870 8.1387 12.8535 2.5503 5.5488 34.1377 7.8808 15.8750 65.9359 48.3179 20.1705 10.9367 32.0128 168.2107 13.1581 16.7759 20.1620 55.8978 52.1271 7.6850 22.8993 59.5244 498.3097 175.8448 20.6270 50.3407 26.6408 12.5420 8.0476 34.8636 40.6814 10.8915 8.4355 0.1791 459.9245 86.5870 23.8442 6.0948 18.9328
temp: 298.150 k
press: 1.00000 atm
elementType: 8 8 8 8 8 8 8 7 7 7 6 6 6 6 6 6 6 6 1 1 1 1 1 1 1 1 1 1 1 1 1 1 1
symmnumber: 1
zpe: 665214.5 jmol-1
zpe.correction: 0.253367 hartree
zpe.thermalcorrener: 0.272275 hartree
zpe.thermalcorrenthalpy: 0.273219 hartree
zpe.thermalcorrgfe: 0.205533 hartree
zpe.sumelectzpe: -1003.170938 hartree
zpe.sumelectthermal: -1003.152029 hartree
zpe.sumelectthermalent: -1003.151085 hartree
zpe.sumelectthermalfe: -1003.218772 hartree
dipole: -3.0302 -1.3064 2.2741
dipole: 4.0075
quadrupole: -124.8103 -107.9590 -106.3150
quadrupole: -8.1537 2.5304 -3.8676
quadrupole: -11.7822 5.0691 6.7131 -8.1537 2.5304 -3.8676
hfenergy: -1003.4243046 hartree
pointgroup: C01 [X(C8H15N3O7)]
dipole: -1.157992 -1.0353996 0.2700606 debye
polarizability: 179.8306021|6.1862739|107.3043832|5.6243847|22.6010669|123.3692376 unknown
InChI: InChI=1S/C8H15N3O7/c1-11(10-17)8(16)9-4-6(14)5(13)3(2-12)18-7(4)15/h3-7,9,12-15H,2H2,1H3
charge 0 multiplicity 1
33 atoms
O  2.406108 -1.284994 -0.270522
O  0.268268 1.778458 1.65914
O  2.886001 2.260218 0.775982
O  0.624538 -0.934559 -1.870104
O  5.073953 -0.927081 -1.164829
O  -2.176529 0.505394 1.85525
O  -4.781181 -0.849525 -1.674312
N  -1.222356 -0.416543 -0.068819
N  -3.576004 -0.168176 0.093322
N  -3.607762 -0.744376 -1.186826
C  0.788764 1.002919 0.530592
C  0.167039 -0.415497 0.432231
C  2.307182 0.919645 0.778297
C  2.992812 0.099127 -0.317505
C  0.983962 -1.343131 -0.508516
C  4.492778 -0.098748 -0.10528
C  -2.274363 -0.003493 0.690931
C  -4.800586 0.271079 0.784193
H  0.605598 1.544013 -0.420847
H  0.185005 -0.860271 1.44675
H  2.465599 0.427497 1.763931
H  2.798619 0.533157 -1.316648
H  0.724976 -2.405135 -0.337081
H  4.670479 -0.543354 0.897012
H  4.999388 0.87619 -0.161808
H  -1.370072 -0.683662 -1.050213
H  -0.638891 1.444133 1.932337
H  2.310033 2.815761 1.365401
H  1.069446 -1.529293 -2.524465
H  4.581266 -1.787896 -1.166783
H  -4.502809 0.682522 1.758395
H  -5.483022 -0.585658 0.916353
H  -5.319138 1.035181 0.180041
