program: Gaussian 09
title: 000029380
version: EM64L-G09RevD.01
frameworkgroup: C1[X(C19H21ClN2)]
method: RPBEPBE
basis: SDD
operation: Freq
keyword: #p
keyword: freq=noraman
keyword: PBEPBE/SDD
title: #p freq=noraman PBEPBE/SDD
converged: YES YES NO NO
title: Mulliken charges:
elementType: Cl N N C C C C C C C C C C C C C C C C C C C H H H H H H H H H H H H H H H H H H H H H
charge: -0.082821 -0.066588 -0.175620 -0.321411 -0.249230 -0.455358 0.239813 -0.406374 0.304943 0.321672 -0.428069 0.255729 -0.730620 -0.373020 -0.420981 -0.335168 -0.361479 -0.675524 -0.258373 -0.253110 -0.153530 -0.249707 0.265715 0.211599 0.227051 0.211032 0.225261 0.208532 0.213907 0.231671 0.221589 0.245676 0.208216 0.248491 0.237705 0.282922 0.243376 0.245008 0.236791 0.208121 0.227298 0.225217 0.249649
chargesum: 0.00000
title: Mulliken charges with hydrogens summed into heavy atoms:
elementType: Cl N N C C C C C C C C C C C C C C C C C C C
charge: -0.082821 -0.066588 -0.175620 -0.055696 -0.037631 -0.017274 0.239813 0.027419 0.304943 0.321672 0.017509 0.255729 -0.055139 -0.124529 -0.183276 -0.052247 -0.118103 0.014397 -0.031075 -0.027893 -0.153530 -0.000059
polarizability: 2.53511403e+02 1.28966128e+01 2.49203041e+02 -1.06351211e+01 1.78413526e+00 1.69985437e+02
1716.lowfreq: -8.5216 -4.5032 0.0012 0.0018 0.0027 8.4289 36.6571 48.0501 70.0562
frequency: 36.5947 48.0195 70.0400 90.7173 101.7111 118.0179 143.0203 170.0994 186.6635 198.9968 216.0207 230.0526 249.2679 265.5135 277.2602 302.2674 317.6447 347.8408 359.4478 363.4269 382.4103 399.9311 417.9181 444.6943 485.0327 502.7968 514.2209 547.4169 554.7111 564.7676 588.2261 617.8848 648.8203 655.7972 706.0756 724.4508 740.3023 765.4110 773.7037 806.3020 827.6277 846.3501 859.3647 880.1545 890.9138 898.8546 904.4781 929.5818 940.5322 953.1976 968.1884 987.4838 1008.5276 1026.3936 1037.4304 1066.0878 1073.2645 1079.9833 1088.3841 1102.8011 1110.6020 1117.2754 1131.5533 1144.0799 1155.4700 1165.4170 1174.0104 1193.6088 1209.3954 1219.0482 1227.2608 1239.2196 1250.4096 1263.0019 1280.7704 1290.9481 1305.7270 1312.6711 1318.9471 1339.8145 1363.4250 1364.2048 1375.7401 1384.3386 1389.9145 1397.0439 1406.5625 1437.8753 1440.4525 1463.4079 1468.8383 1470.5371 1473.4595 1480.9248 1483.5281 1484.6040 1489.3730 1506.5986 1566.3449 1591.8261 1597.2232 1615.0572 2869.7257 2877.9753 2899.1797 2929.2349 2972.5877 2973.5959 2978.9649 2992.1850 3008.6191 3021.4220 3024.8161 3070.9805 3085.9880 3091.6825 3110.8242 3118.1391 3137.0036 3146.7162 3155.3181 3159.1783 3169.7178
redmass: 4.4776 5.6635 4.6258 3.5348 3.5132 3.8568 2.9428 4.5759 3.9435 3.0250 1.1358 2.1989 2.0451 2.9833 2.6887 4.0117 2.6640 5.5271 3.0265 2.7939 3.6917 4.6043 4.1339 3.5867 3.9468 3.3324 3.9876 3.4075 3.7651 3.5865 3.5297 5.1284 4.7543 4.3539 3.9422 4.4785 3.9513 1.4234 3.2828 1.5220 2.6975 2.6943 2.5316 1.5223 1.8976 2.1531 3.2645 1.3587 2.1740 1.4118 1.7546 1.3228 1.9197 2.3292 2.3131 2.0674 2.1587 2.0807 2.4079 2.0326 1.5147 1.9632 2.1152 2.2684 2.1893 1.9769 1.0626 2.0358 1.7869 2.0014 1.3311 1.2856 1.5248 1.5961 1.4034 1.4485 1.7102 1.5412 1.5602 1.3921 1.5299 4.7667 1.2399 3.9648 1.8850 1.4621 3.3778 1.3924 1.9693 1.0608 1.4304 1.1017 1.2100 1.2047 1.0787 1.0752 2.0014 1.3963 8.0540 7.2196 6.4902 6.3906 1.0707 1.0704 1.0528 1.0652 1.0826 1.0620 1.0560 1.0961 1.0886 1.0890 1.0793 1.0989 1.1000 1.1003 1.0869 1.0887 1.0929 1.0874 1.0917 1.1004 1.0965
irintensity: 0.0780 0.1075 0.4823 0.9040 0.8754 1.4753 4.9197 0.6625 2.0721 2.0893 0.0608 0.1546 1.9316 1.5213 3.3891 4.3619 1.7583 0.4869 5.9194 0.0856 1.9965 1.5768 3.4187 1.5925 3.9855 4.2270 5.0017 5.5559 12.2337 24.6222 11.4496 10.3429 3.0819 0.4375 14.4246 7.4233 25.2923 53.4058 2.7306 42.7182 1.0225 11.0328 14.6341 1.9530 6.1863 5.2626 2.1509 1.4366 1.3539 1.0264 4.1421 0.0997 15.6383 2.3467 7.5659 13.3309 16.1809 3.2711 16.6742 11.8564 6.4161 45.3847 8.7006 13.5387 19.0890 10.4428 0.5824 29.4309 0.1057 4.6790 9.1766 5.2433 25.2543 1.5873 13.0240 0.2943 39.1601 61.9061 4.6193 0.7690 10.5780 7.0650 22.1345 0.3713 0.8710 15.5142 16.0834 16.7906 14.9759 8.2992 42.3155 5.1494 80.3379 1.1213 3.2973 8.7674 26.0700 82.0640 1.4816 1.2878 25.6811 2.7755 14.9217 101.7737 126.3133 108.3613 5.4085 31.5491 45.3057 48.6750 54.5716 47.2288 37.5025 43.9423 21.8630 20.3511 13.5051 3.2545 27.3957 9.7007 0.3252 33.2156 9.9190
temp: 298.150 k
press: 1.00000 atm
elementType: 17 7 7 6 6 6 6 6 6 6 6 6 6 6 6 6 6 6 6 6 6 6 1 1 1 1 1 1 1 1 1 1 1 1 1 1 1 1 1 1 1 1 1
symmnumber: 1
zpe: 931875.8 jmol-1
zpe.correction: 0.354933 hartree
zpe.thermalcorrener: 0.374081 hartree
zpe.thermalcorrenthalpy: 0.375025 hartree
zpe.thermalcorrgfe: 0.308198 hartree
zpe.sumelectzpe: -1304.574661 hartree
zpe.sumelectthermal: -1304.555513 hartree
zpe.sumelectthermalent: -1304.554569 hartree
zpe.sumelectthermalfe: -1304.621396 hartree
dipole: -0.6317 -3.8900 0.2332
dipole: 3.9479
quadrupole: -127.3591 -137.0396 -134.4727
quadrupole: 14.0564 -6.9109 4.2427
quadrupole: 5.5980 -4.0825 -1.5155 14.0564 -6.9109 4.2427
hfenergy: -1304.9295942 hartree
pointgroup: C01 [X(C19H21Cl1N2)]
dipole: -0.5057583 -1.4406152 0.2851189 debye
polarizability: 257.5102218|9.9267309|244.6223614|-12.4772511|-6.2128235|170.5672983 unknown
InChI: InChI=1S/C19H21ClN2/c1-13-12-22-10-9-21(2)18-8-7-14(20)11-17(18)19(22)16-6-4-3-5-15(13)16/h3-8,11,13,19H,9-10,12H2,1-2H3
charge 0 multiplicity 1
43 atoms
Cl -1.738931 3.952605 -1.683568
N  0.342589 -1.777614 -0.48198
N  -2.492234 -1.45223 0.98461
C  0.181973 -0.610109 0.445539
C  2.555774 -1.101081 -1.366742
C  1.088284 -1.42643 -1.714284
C  1.497874 0.14586 0.614104
C  -0.94582 -2.44042 -0.793056
C  2.610159 -0.069506 -0.241519
C  -1.00862 0.284502 0.050273
C  -1.832141 -2.676526 0.440527
C  -2.329761 -0.189318 0.361092
C  3.338013 -2.386525 -0.983599
C  1.602399 1.092634 1.665957
C  3.801189 0.671314 -0.022189
C  -0.846685 1.534468 -0.584574
C  -3.443412 0.654253 0.086253
C  -3.726281 -1.734763 1.72763
C  2.789375 1.821517 1.877314
C  3.89935 1.610377 1.023728
C  -1.973523 2.328973 -0.86901
C  -3.271231 1.916532 -0.522028
H  -0.084208 -1.038915 1.432604
H  3.032972 -0.661725 -2.267169
H  0.618819 -0.567338 -2.254275
H  1.051876 -2.299413 -2.393439
H  -0.715391 -3.427589 -1.238725
H  -1.542463 -1.873361 -1.550036
H  -2.631481 -3.384971 0.128168
H  -1.245283 -3.178003 1.236729
H  4.364843 -2.147152 -0.654139
H  2.818848 -2.906899 -0.159988
H  3.405028 -3.074425 -1.847707
H  0.736383 1.260414 2.317934
H  4.657576 0.508479 -0.689156
H  0.158873 1.904827 -0.80568
H  -4.45783 0.32006 0.324341
H  -4.020549 -0.859363 2.330925
H  -3.54512 -2.576531 2.420572
H  -4.583293 -2.016891 1.072128
H  2.850762 2.547797 2.695219
H  4.826269 2.175533 1.172796
H  -4.134869 2.553753 -0.73448
