program: Gaussian 09
title: 000029329
version: EM64L-G09RevD.01
frameworkgroup: C1[X(C21H25NO)]
method: RPBEPBE
basis: SDD
operation: Freq
keyword: #p
keyword: freq=noraman
keyword: PBEPBE/SDD
title: #p freq=noraman PBEPBE/SDD
converged: YES YES NO NO
title: Mulliken charges:
elementType: O N C C C C C C C C C C C C C C C C C C C C C H H H H H H H H H H H H H H H H H H H H H H H H H
charge: -0.281986 -0.090069 0.027304 -0.590504 -0.474342 -0.438496 0.298224 0.299377 0.379033 0.379596 -0.441784 -0.393601 -0.395447 -0.479049 -0.479575 -0.260826 -0.260763 -0.237031 -0.236705 -0.250344 -0.367062 -0.611293 -0.615660 0.239363 0.223712 0.223534 0.229955 0.230270 0.200005 0.199587 0.262918 0.263747 0.239031 0.239099 0.219700 0.220419 0.222051 0.222142 0.206864 0.187857 0.191059 0.227038 0.228507 0.189191 0.220498 0.188410 0.223702 0.222345
chargesum: 0.00000
title: Mulliken charges with hydrogens summed into heavy atoms:
elementType: O N C C C C C C C C C C C C C C C C C C C C C
charge: -0.281986 -0.090069 0.027304 -0.351141 -0.027095 0.021728 0.298224 0.299377 0.379033 0.379596 -0.042192 -0.130683 -0.131700 -0.240018 -0.240476 -0.041126 -0.040344 -0.014981 -0.014563 0.144376 0.051035 0.026903 0.018798
polarizability: 2.57488076e+02 -1.54083400e+00 2.47563104e+02 1.13411458e+01 2.96020914e-01 1.74369530e+02
1716.lowfreq: -18.0754 -9.7266 -7.1825 -0.0005 -0.0004 0.0003 4.2266 16.8868 35.2419
frequency: -16.3812 16.6621 35.0540 66.0579 78.4163 85.8751 120.9469 123.1266 148.5384 151.7336 164.6862 194.1229 208.2041 223.6673 235.8783 247.9348 264.5878 319.1267 332.1957 346.2352 349.6296 387.1839 404.1334 425.4977 444.2210 454.6032 472.8738 483.5102 506.8089 559.5928 572.8036 597.6710 605.5252 628.0626 696.6403 717.5403 744.5301 755.0868 758.9867 764.6620 807.4676 813.9394 814.6839 820.7231 851.0488 856.6604 872.2752 881.0730 884.0542 926.3521 940.1675 941.6732 980.5130 981.0748 1000.9694 1002.1395 1018.4653 1026.4838 1027.0117 1033.4646 1039.7972 1048.2016 1050.6548 1066.8298 1071.4144 1086.9010 1097.2331 1103.2218 1139.0650 1140.4709 1146.0022 1169.6641 1170.2322 1172.3795 1174.4561 1181.7214 1197.5441 1199.8044 1217.0252 1231.1721 1239.2815 1250.6314 1264.9499 1284.3004 1284.9910 1286.0357 1308.8442 1320.0060 1320.4073 1330.8319 1368.5838 1389.2296 1390.5988 1407.6846 1419.6823 1442.7398 1444.2450 1446.1403 1457.3716 1460.4299 1460.9682 1464.7469 1470.2302 1474.2585 1475.9256 1478.5531 1485.0432 1488.3200 1493.4372 1587.3628 1596.6545 1611.1472 1619.6542 2847.2315 2855.2221 2872.5945 2909.2679 2927.7747 2953.4551 2984.5118 2989.1448 3008.0093 3021.0163 3029.1884 3044.8689 3046.6578 3047.2134 3072.3987 3079.6733 3085.7644 3116.6513 3117.0358 3128.7607 3129.4776 3148.6560 3149.0361 3163.8380 3164.4184
redmass: 2.5289 4.4670 4.2344 4.7472 2.9150 1.9590 3.7713 3.2438 4.1964 4.0495 4.1619 1.8820 3.6847 1.2527 1.2146 2.3351 2.3920 3.5298 3.3954 3.3134 2.7258 3.3409 4.3904 3.4136 3.3728 3.3142 4.9329 3.2879 4.4329 3.7569 3.7201 3.9416 4.2782 5.3868 4.8371 5.6000 2.1396 4.1567 1.3272 1.3192 3.0550 4.7161 1.2063 2.8139 1.4604 3.3967 1.3672 3.4307 2.0042 4.0803 1.4034 1.4993 1.3259 1.3210 3.5114 1.9832 4.4414 2.4506 2.5157 1.5709 2.6912 2.2106 4.5188 3.2594 1.9234 1.4349 2.1818 1.7979 1.5553 1.4893 1.3234 1.3140 1.2343 1.0774 1.1519 1.7690 1.4276 3.0326 1.1554 1.7226 2.0540 1.3480 2.5485 1.4407 1.6434 1.3279 1.5795 1.5358 1.3358 1.6782 1.3525 6.0316 7.7355 1.4225 1.1704 2.2774 1.1753 2.5548 1.0991 2.3644 1.0504 1.0726 1.1650 1.1992 1.0528 1.1114 1.0997 1.6275 1.1194 6.4669 7.2490 6.8513 6.9800 1.0572 1.0624 1.0650 1.0550 1.0561 1.1050 1.1032 1.0577 1.0611 1.0726 1.0719 1.1045 1.0904 1.0873 1.1058 1.1010 1.1006 1.0859 1.0859 1.0899 1.0899 1.0952 1.0951 1.0979 1.0980
irintensity: 0.5052 0.2303 0.1358 0.5563 0.6409 3.3134 1.1654 0.4789 5.8227 0.6329 0.5109 0.0012 0.1420 0.3565 1.0309 0.9646 1.8650 4.2393 0.2757 2.1168 5.6920 2.0112 0.2738 1.3527 4.2843 2.9333 0.4494 0.4284 0.0141 37.1443 0.2689 3.1644 2.7753 1.3725 3.0539 1.8797 0.6328 1.0904 41.0248 101.0977 0.2774 18.4304 1.8743 0.0656 6.2873 0.9166 0.0338 1.2858 1.5472 15.4131 0.6361 0.8499 0.2268 0.1345 7.6572 4.5932 23.9755 8.6129 3.3354 23.8987 55.2499 2.6322 80.4711 41.1356 44.6450 8.5914 4.4720 0.2501 14.0092 0.8098 14.9795 4.0833 2.0486 1.6946 0.1072 0.4632 0.2964 0.1172 1.4611 6.1850 5.4388 0.2053 11.2886 0.1274 1.4058 3.4178 2.6262 3.4556 6.3684 4.0220 6.2395 1.7745 0.1258 3.8245 1.6186 9.4027 2.0957 3.0236 1.4829 40.4265 17.5064 0.9082 20.1330 16.6290 12.2276 12.8916 12.1244 5.3342 14.9431 0.9854 0.2593 0.0352 1.1607 69.6560 93.6723 165.4907 36.3376 89.1601 53.8461 42.3241 34.6207 60.9519 43.0840 51.1033 4.2905 26.8078 38.0616 56.0105 29.8848 54.5842 1.1658 3.5357 13.7953 18.3483 32.8224 39.3789 32.7366 13.5771
temp: 298.150 k
press: 1.00000 atm
elementType: 8 7 6 6 6 6 6 6 6 6 6 6 6 6 6 6 6 6 6 6 6 6 6 1 1 1 1 1 1 1 1 1 1 1 1 1 1 1 1 1 1 1 1 1 1 1 1 1
symmnumber: 1
zpe: 1068216.2 jmol-1
zpe.correction: 0.406862 hartree
zpe.thermalcorrener: 0.426984 hartree
zpe.thermalcorrenthalpy: 0.427928 hartree
zpe.thermalcorrgfe: 0.357820 hartree
zpe.sumelectzpe: -943.494038 hartree
zpe.sumelectthermal: -943.473915 hartree
zpe.sumelectthermalent: -943.472971 hartree
zpe.sumelectthermalfe: -943.543079 hartree
dipole: 0.8221 -0.6268 1.3854
dipole: 1.7287
quadrupole: -120.2063 -134.4152 -135.7279
quadrupole: -3.3043 -0.3844 -1.3469
quadrupole: 9.9102 -4.2987 -5.6115 -3.3043 -0.3844 -1.3469
hfenergy: -943.9008996 hartree
pointgroup: C01[X(C21H25N1O1)]
dipole: 0.3294288 0.220308 -0.5527048 debye
polarizability: 257.6177844|0.9535492|247.4454844|-11.073666|-2.3152708|174.357441 unknown
InChI: InChI=1S/C21H25NO/c1-22(2)13-14-23-15-21-12-11-16(17-7-3-5-9-19(17)21)18-8-4-6-10-20(18)21/h3-10,16H,11-15H2,1-2H3
charge 0 multiplicity 1
48 atoms
O  1.729015 -0.096659 -0.392247
N  5.430231 -0.373935 0.095968
C  -0.664906 0.012981 -0.983829
C  -3.192256 0.152156 -0.217394
C  -1.635925 0.057968 -2.242536
C  -3.128902 0.138408 -1.790577
C  -0.996423 1.27686 -0.171356
C  -1.128487 -1.198694 -0.157531
C  -2.359252 1.346624 0.23154
C  -2.490251 -1.118385 0.246552
C  0.773975 -0.066733 -1.504303
C  -0.111836 2.322196 0.162171
C  -0.359312 -2.327975 0.187939
C  -2.835054 2.45739 0.954084
C  -3.080059 -2.163428 0.983032
C  -0.59067 3.439995 0.889074
C  -0.952747 -3.379702 0.928778
C  -1.946484 3.510166 1.284019
C  -2.307561 -3.30041 1.32544
C  3.119611 -0.190655 -0.857019
C  3.999402 -0.137093 0.399967
C  6.19603 -0.748301 1.303284
C  6.066182 0.749692 -0.623819
H  -4.236249 0.209471 0.13562
H  -1.460957 -0.84887 -2.850926
H  -1.368166 0.935385 -2.860267
H  -3.606709 1.054927 -2.180463
H  -3.699599 -0.728561 -2.168638
H  0.984472 0.814472 -2.15285
H  0.89515 -0.982175 -2.127164
H  0.945267 2.252362 -0.109759
H  0.698326 -2.37655 -0.086582
H  -3.886583 2.50356 1.262044
H  -4.130046 -2.094222 1.2919
H  0.097474 4.25004 1.15708
H  -0.35429 -4.255409 1.205392
H  -2.30806 4.37508 1.851861
H  -2.757857 -4.115385 1.903627
H  3.291592 -1.146893 -1.396449
H  3.33778 0.648841 -1.553963
H  3.827529 0.837997 0.922619
H  3.650366 -0.933993 1.081584
H  5.745245 -1.642741 1.76831
H  6.233857 0.061901 2.075511
H  7.234865 -0.996875 1.020598
H  6.056904 1.706254 -0.039836
H  5.55702 0.931932 -1.585663
H  7.117846 0.495087 -0.845521
