program: Gaussian 09
title: 000029395
version: EM64L-G09RevD.01
frameworkgroup: C1[X(C20H19NO)]
method: RPBEPBE
basis: SDD
operation: Freq
keyword: #p
keyword: freq=noraman
keyword: PBEPBE/SDD
title: #p freq=noraman PBEPBE/SDD
converged: YES YES NO NO
title: Mulliken charges:
elementType: O N C C C C C C C C C C C C C C C C C C C C H H H H H H H H H H H H H H H H H H H
charge: -0.208315 -0.336894 0.084262 0.315633 0.061108 -0.538647 -0.523425 0.213059 -0.423021 -0.334744 0.431183 -0.024264 -0.008008 -0.258743 -0.227759 -0.406228 -0.342430 -0.595379 -0.596327 -0.219185 -0.217864 -0.245297 0.210446 0.230574 0.227933 0.207606 0.239716 0.266814 0.235961 0.232070 0.226941 0.226001 0.268192 0.270528 0.215477 0.224441 0.217528 0.211039 0.229249 0.229856 0.230913
chargesum: 0.00000
title: Mulliken charges with hydrogens summed into heavy atoms:
elementType: O N C C C C C C C C C C C C C C C C C C C C
charge: -0.208315 -0.336894 0.084262 0.315633 0.061108 -0.097627 -0.087886 0.213059 -0.183306 -0.067929 0.431183 0.211696 0.224061 -0.031802 -0.001759 -0.138036 -0.071902 -0.155462 -0.167760 0.010064 0.011992 -0.014383
polarizability: 2.63348353e+02 -1.64687148e+01 2.30296929e+02 -2.11830703e+00 1.09092435e+01 1.62108837e+02
1716.lowfreq: -12.6203 -5.9076 -0.0003 -0.0003 0.0006 6.2171 22.1949 44.7575 47.9698
frequency: 22.0640 44.7501 47.9078 59.4150 61.2165 68.5528 86.1323 91.7700 125.0556 140.6737 174.4332 191.3126 205.6980 254.3402 274.7491 286.4349 310.8322 339.7857 364.6390 397.0030 408.2138 412.7314 437.1953 471.3482 488.2058 507.7223 522.0448 566.3850 611.5356 613.6771 638.8611 646.1376 656.5678 691.7178 698.3738 734.6880 756.3615 763.8434 767.7810 782.9416 842.3831 858.5360 868.4319 898.2159 902.1151 914.2432 938.6939 942.5750 944.0143 951.9658 961.0162 972.2530 977.0328 980.2970 988.8972 993.5759 1011.0613 1012.0605 1024.7970 1026.2739 1042.7396 1053.2283 1081.9782 1100.0775 1115.6027 1134.0178 1165.2149 1172.0681 1173.6034 1185.3117 1194.7247 1216.5276 1224.1913 1262.9312 1272.0835 1290.1580 1292.7819 1299.5095 1324.9451 1335.2191 1340.1488 1381.2767 1402.8062 1423.7271 1426.4197 1441.6341 1445.4253 1453.7359 1457.5665 1474.2927 1491.4888 1588.8076 1602.0489 1611.3871 1619.9698 1651.4908 1657.6362 1661.7079 2966.9127 2973.5884 3037.9512 3045.8740 3081.9079 3085.2198 3094.7598 3101.5206 3125.0435 3129.6721 3136.7487 3140.0365 3153.1708 3157.8920 3165.6801 3171.2195 3182.3405 3194.3962 3196.3704
redmass: 4.7146 3.7073 3.3049 3.6134 3.9882 3.0226 4.7570 3.6543 3.5823 2.5445 3.3435 3.7328 3.7670 4.0081 5.1791 3.9684 3.3179 3.9672 2.4199 4.4576 2.9572 2.6794 2.5388 3.3946 5.9576 3.3196 2.7310 2.8644 3.6754 5.4780 4.3278 2.5341 2.9042 4.6795 2.0158 3.1067 1.4610 1.8542 3.0630 3.1145 1.3230 3.2219 1.3577 1.5090 2.2929 1.5683 1.5696 2.7340 1.3951 1.3594 1.9937 1.3648 1.9401 1.3148 4.9656 1.3797 1.1539 1.1717 2.4148 2.1133 3.7717 4.0629 1.8071 2.2368 1.5765 2.0070 2.3787 1.1692 1.0560 1.3412 1.8776 1.6742 1.7148 1.4520 1.3504 1.2605 1.2949 1.4936 1.3587 1.6860 3.6532 7.8947 5.3223 1.1508 1.1747 2.1890 1.1590 2.5980 1.1279 2.6995 2.8267 6.4410 7.1691 6.3586 7.4178 11.0598 4.6771 4.7170 1.0621 1.0594 1.1006 1.0980 1.0646 1.0616 1.0895 1.0920 1.0870 1.0850 1.0895 1.0892 1.0942 1.0948 1.0991 1.0983 1.0972 1.1143 1.1147
irintensity: 0.5749 0.3704 0.1885 0.2639 0.9002 0.3732 0.7188 0.3522 0.1514 0.2733 3.0625 0.0616 0.2376 0.6159 3.6789 4.9305 0.2644 1.2593 1.0290 1.0205 0.5857 0.1748 0.5807 6.0255 6.7794 8.3169 5.9342 4.2845 19.5160 3.7127 1.7553 19.1755 14.2080 0.9115 43.9571 16.9485 49.6556 75.5702 6.2076 1.6057 0.4115 4.2325 0.9194 1.7739 0.1676 1.1910 3.0955 8.9948 67.6508 81.7763 5.6350 0.4632 11.6914 0.0209 0.1673 0.0965 20.2172 19.3410 16.5623 8.0597 1.2740 1.0563 10.6824 42.9047 0.6812 28.6385 46.4316 0.7907 0.0549 15.6742 9.2776 25.4325 23.1076 5.8892 1.2119 1.8259 10.3711 13.5017 2.2813 9.2423 118.8685 0.2812 3.1789 8.1188 1.2090 15.4231 8.6476 43.4976 33.7011 35.3599 157.3531 14.6735 27.8274 51.1822 73.3629 156.1988 8.7603 12.4087 18.8617 42.5177 5.5425 13.1333 16.0124 11.5951 5.8890 9.5356 4.3556 1.1344 9.8256 13.0678 42.6428 11.3763 20.9367 14.6594 2.3439 22.9830 21.1976
temp: 298.150 k
press: 1.00000 atm
elementType: 8 7 6 6 6 6 6 6 6 6 6 6 6 6 6 6 6 6 6 6 6 6 1 1 1 1 1 1 1 1 1 1 1 1 1 1 1 1 1 1 1
symmnumber: 1
zpe: 866935.7 jmol-1
zpe.correction: 0.330198 hartree
zpe.thermalcorrener: 0.350148 hartree
zpe.thermalcorrenthalpy: 0.351092 hartree
zpe.thermalcorrgfe: 0.280345 hartree
zpe.sumelectzpe: -901.930345 hartree
zpe.sumelectthermal: -901.910396 hartree
zpe.sumelectthermalent: -901.909452 hartree
zpe.sumelectthermalfe: -901.980199 hartree
dipole: 0.4733 -2.0475 -1.7077
dipole: 2.7079
quadrupole: -112.0825 -125.1529 -134.2975
quadrupole: 1.2376 1.0556 -1.7904
quadrupole: 11.7618 -1.3086 -10.4532 1.2376 1.0556 -1.7904
hfenergy: -902.2605438 hartree
pointgroup: C01 [X(C20H19N1O1)]
dipole: -0.2127134 -0.8725067 0.5731331 debye
polarizability: 264.193616|15.7760849|231.0437305|0.3760184|-2.7001368|160.5167725 unknown
InChI: InChI=1S/C20H19NO/c1-3-14-20(15-4-2)17-12-8-9-13-18(17)21(19(20)22)16-10-6-5-7-11-16/h3-13H,1-2,14-15H2
charge 0 multiplicity 1
41 atoms
O  0.381756 2.102995 -1.201502
N  0.607909 0.04693 -0.014594
C  -1.629748 0.835776 -0.413076
C  -1.631295 -0.475306 0.353881
C  -0.116801 1.11432 -0.60647
C  -2.269571 2.024471 0.387799
C  -2.325066 0.746749 -1.816999
C  -0.294166 -0.897979 0.574007
C  -2.699011 -1.229984 0.860481
C  0.001354 -2.05678 1.317505
C  2.038529 -0.072643 -0.055375
C  -1.716246 2.20701 1.785567
C  -1.720016 -0.273679 -2.75705
C  -2.424162 -2.412244 1.595735
C  -1.086253 -2.810965 1.823926
C  2.641654 -1.30462 -0.414072
C  2.845399 1.055176 0.233504
C  -1.065588 3.317753 2.213494
C  -2.380903 -1.335718 -3.279984
C  4.048312 -1.409731 -0.461235
C  4.250646 0.942355 0.171719
C  4.858781 -0.288639 -0.167503
H  -3.362123 1.835258 0.438293
H  -2.115004 2.946765 -0.202997
H  -2.24525 1.754612 -2.27326
H  -3.399345 0.531424 -1.659767
H  -3.734924 -0.911172 0.696076
H  1.03165 -2.363806 1.51692
H  -1.869809 1.370225 2.483031
H  -0.669926 -0.10128 -3.039214
H  -3.247949 -3.013898 1.994052
H  -0.881877 -3.716864 2.405497
H  2.015219 -2.162386 -0.679304
H  2.371792 2.006058 0.490286
H  -0.691068 3.403122 3.240072
H  -0.885796 4.170513 1.547041
H  -1.89377 -2.031827 -3.971954
H  -3.429443 -1.541455 -3.029204
H  4.509059 -2.363859 -0.739898
H  4.870843 1.8179 0.39246
H  5.950206 -0.371674 -0.209386
