program: Gaussian 09
title: 000029309
version: EM64L-G09RevD.01
frameworkgroup: C1[X(C13H21NO)]
method: RPBEPBE
basis: SDD
operation: Freq
keyword: #p
keyword: freq=noraman
keyword: PBEPBE/SDD
title: #p freq=noraman PBEPBE/SDD
converged: YES YES NO NO
title: Mulliken charges:
elementType: O N C C C C C C C C C C C C C H H H H H H H H H H H H H H H H H H H H H
charge: -0.470336 -0.422068 -0.092882 -0.201471 -0.322914 -0.073344 -0.738491 0.433456 -0.683007 -0.697076 -0.395961 -0.415250 -0.227166 -0.232762 -0.243921 0.207614 0.200677 0.196314 0.212803 0.185876 0.268912 0.250041 0.232703 0.201745 0.207402 0.210873 0.225374 0.208033 0.218479 0.211524 0.282961 0.226064 0.368321 0.222018 0.221153 0.224309
chargesum: 0.00000
title: Mulliken charges with hydrogens summed into heavy atoms:
elementType: O N C C C C C C C C C C C C C
charge: -0.102015 -0.153157 0.114732 -0.000794 0.086203 0.112531 -0.054002 0.433456 -0.039359 -0.059040 -0.113000 -0.189186 -0.005148 -0.011609 -0.019611
polarizability: 2.01754856e+02 3.78550466e-01 1.42029684e+02 -4.14758158e-01 -1.64556308e+00 1.04313187e+02
1716.lowfreq: -16.5516 -9.3712 0.0001 0.0005 0.0006 3.8327 20.9149 34.6974 41.2338
frequency: 17.6759 34.6669 41.1531 54.3434 89.5967 125.6989 132.6219 188.5122 200.5853 218.3956 223.1492 235.0838 257.1526 296.7910 324.5595 346.0335 389.0466 404.1789 410.0118 455.4390 473.3773 509.4612 615.7066 625.2101 654.5248 698.3157 708.4907 736.6949 757.0135 810.9085 822.3980 847.1345 859.2301 903.4038 917.0772 925.6217 930.4249 951.8612 963.9530 977.0374 979.8993 989.3765 999.9992 1025.3033 1055.1017 1066.3214 1093.9028 1102.5538 1126.6886 1136.2306 1169.1713 1177.5919 1178.8060 1190.3286 1204.8628 1227.6059 1244.2509 1282.0459 1287.8830 1303.7833 1324.7662 1329.9843 1335.7791 1361.1465 1377.2650 1386.5907 1387.1811 1393.8878 1398.1516 1436.5697 1441.0920 1463.8928 1467.4406 1472.7080 1480.0194 1480.7938 1483.5268 1484.2704 1488.2104 1592.9719 1615.1758 2887.2897 2900.5732 2923.7651 2941.5138 2971.0594 2975.3828 2982.7894 3005.1570 3062.7114 3068.7732 3072.7239 3075.5904 3084.7052 3105.2667 3107.7114 3123.2437 3136.5864 3155.2619 3170.5661 3204.0124 3441.0088
redmass: 2.7806 4.0615 3.6263 3.5678 3.8253 2.7342 2.4423 1.1163 3.2360 1.1262 1.6041 3.3363 2.0734 2.9858 2.6362 2.7549 2.6894 2.8103 2.7519 3.0289 2.6830 3.3381 6.2162 3.9818 2.1540 1.8347 1.7660 1.6094 1.3059 2.7065 2.7757 3.1934 1.2495 1.3903 1.2316 1.4233 1.5978 1.5532 1.7215 2.4292 1.3596 5.8486 1.3376 2.1002 3.1657 1.8393 1.8369 1.7784 3.5175 2.0374 1.0651 1.8127 1.1392 2.1220 2.2056 1.2642 1.2367 1.2100 1.2684 1.3233 1.2872 1.3363 1.4207 1.4563 1.2270 6.4697 1.2792 1.4220 1.2940 1.9165 1.3305 1.0543 1.0471 1.0576 1.0665 1.1016 1.1897 1.7784 1.0612 6.2055 6.1418 1.0694 1.0815 1.0842 1.0825 1.0357 1.0368 1.0381 1.0914 1.0995 1.0992 1.0984 1.0991 1.0987 1.0983 1.0871 1.0866 1.0930 1.0979 1.0966 1.0629 1.0748
irintensity: 0.0822 0.2925 0.4255 1.4142 1.0357 0.6171 1.0816 0.0525 2.4394 0.0076 1.0005 1.5826 2.1577 3.4538 6.6225 5.6093 3.2534 0.1616 4.0987 4.7109 2.9211 5.3825 0.7987 27.5422 16.2320 43.9187 64.4639 5.5360 127.3845 4.0503 1.8760 2.7312 0.2971 3.5204 5.3359 4.2294 4.0709 8.7939 7.0362 32.8863 0.1865 0.0735 1.0787 11.2049 20.8168 18.4523 10.7422 19.6509 82.5490 0.5330 0.5029 4.7204 3.5512 0.1323 34.5543 13.1468 7.7892 11.3294 13.7573 15.9022 11.9291 9.2976 6.7710 2.9215 13.6960 4.5323 40.5221 33.5337 30.9805 16.8857 14.3162 5.3500 0.3183 8.1685 20.4009 3.3636 7.7533 13.9665 31.2275 0.3496 10.5650 69.2635 39.4188 78.3777 24.6258 38.0287 23.3164 27.1952 32.1539 17.4933 59.9939 29.5470 56.7456 47.5220 20.0009 10.6445 1.3977 36.2191 32.2574 11.4542 194.1796 0.4809
temp: 298.150 k
press: 1.00000 atm
elementType: 8 7 6 6 6 6 6 6 6 6 6 6 6 6 6 1 1 1 1 1 1 1 1 1 1 1 1 1 1 1 1 1 1 1 1 1
symmnumber: 1
zpe: 822859.5 jmol-1
zpe.correction: 0.313411 hartree
zpe.thermalcorrener: 0.329859 hartree
zpe.thermalcorrenthalpy: 0.330803 hartree
zpe.thermalcorrgfe: 0.267873 hartree
zpe.sumelectzpe: -636.774271 hartree
zpe.sumelectthermal: -636.757823 hartree
zpe.sumelectthermalent: -636.756879 hartree
zpe.sumelectthermalfe: -636.819808 hartree
dipole: 2.3126 2.1189 2.1113
dipole: 3.7810
quadrupole: -83.6831 -91.7084 -94.9048
quadrupole: -0.2291 0.6848 -3.1010
quadrupole: 6.4157 -1.6096 -4.8061 -0.2291 0.6848 -3.1010
hfenergy: -637.0876816 hartree
pointgroup: C01 [X(C13H21N1O1)]
dipole: 0.9107602 0.2710367 1.1444941 debye
polarizability: 201.5757034|3.4960491|132.1545473|-1.6455364|16.6938906|114.3674771 unknown
InChI: InChI=1S/C13H21NO/c1-10(2)9-14-11(3)13(15)12-7-5-4-6-8-12/h4-8,10-11,13-15H,9H2,1-3H3
charge 0 multiplicity 1
36 atoms
O  0.166315 -0.919648 -1.396287
N  1.891925 -0.556165 0.595907
C  0.469964 -0.271109 0.944508
C  -0.250809 0.078002 -0.41819
C  2.77844 0.621867 0.422628
C  4.221685 0.212585 0.039622
C  -0.141191 -1.504314 1.632826
C  -1.765417 0.124792 -0.304461
C  4.271764 -0.495043 -1.334005
C  5.144472 1.453731 0.059607
C  -2.570691 -0.899612 -0.857366
C  -2.388341 1.20182 0.376697
C  -3.976514 -0.855562 -0.717262
C  -3.793117 1.243367 0.52224
C  -4.593189 0.211758 -0.023378
H  0.38243 0.609745 1.621849
H  0.108942 1.084827 -0.733484
H  2.807983 1.249313 1.346333
H  2.362885 1.257887 -0.383693
H  4.587772 -0.499192 0.812939
H  2.307613 -1.245634 1.236925
H  -1.184381 -1.310282 1.929891
H  -0.137794 -2.370771 0.946976
H  0.430115 -1.768455 2.543394
H  3.939044 0.191858 -2.135897
H  5.300992 -0.82095 -1.572568
H  3.615391 -1.382609 -1.354738
H  4.806994 2.203247 -0.681991
H  6.183206 1.175487 -0.195076
H  5.154467 1.938477 1.053881
H  -2.076314 -1.707971 -1.404025
H  -1.777392 2.01622 0.788039
H  1.10023 -1.148594 -1.080007
H  -4.591552 -1.651027 -1.154092
H  -4.263193 2.080728 1.050927
H  -5.683535 0.24543 0.082929
