program: Gaussian 09
title: 000029313
version: EM64L-G09RevD.01
frameworkgroup: C1[X(C16H18ClNO)]
method: RPBEPBE
basis: SDD
operation: Freq
keyword: #p
keyword: freq=noraman
keyword: PBEPBE/SDD
title: #p freq=noraman PBEPBE/SDD
converged: YES YES NO NO
title: Mulliken charges:
elementType: Cl O N C C C C C C C C C C C C C C C C H H H H H H H H H H H H H H H H H H
charge: -0.066788 -0.456841 -0.303518 -0.442305 -0.219878 -0.366697 0.490526 -0.484567 0.440516 -0.437676 -0.376890 -0.372140 -0.424686 -0.230763 -0.227019 -0.239981 -0.211771 -0.208425 -0.102930 0.218152 0.205535 0.195096 0.199734 0.216504 0.252811 0.225116 0.201341 0.228469 0.263337 0.334518 0.277407 0.238789 0.225356 0.224362 0.227698 0.253360 0.254247
chargesum: 0.00000
title: Mulliken charges with hydrogens summed into heavy atoms:
elementType: Cl O N C C C C C C C C C C C C C C C C
charge: -0.066788 -0.122323 -0.050706 -0.018618 -0.024782 0.049541 0.490526 -0.058110 0.440516 -0.209207 -0.113553 -0.094733 -0.185897 -0.005407 -0.002657 -0.012283 0.041588 0.045823 -0.102930
polarizability: 2.42636851e+02 2.30420212e+01 1.85353842e+02 2.13763648e+00 6.34562697e+00 1.35068197e+02
1716.lowfreq: -1.2022 0.0013 0.0020 0.0022 5.3321 10.0786 16.4630 23.0342 32.8279
frequency: 15.2786 23.0001 32.8243 39.3463 55.2907 88.7446 108.3659 130.8454 150.3211 163.7644 198.0099 215.3383 248.1458 278.5035 311.1305 319.4468 348.2150 368.4113 392.7596 404.3026 411.5984 461.2614 493.5504 511.9007 556.8874 591.4864 616.6187 625.2070 647.9615 694.4098 706.2066 714.8534 752.0188 770.7074 800.8890 824.9508 833.6259 838.9132 857.4326 924.0660 943.8991 956.9641 974.2060 978.9678 984.2264 989.8511 995.6604 1000.1709 1003.6273 1025.2784 1028.6921 1069.9623 1073.7834 1077.7245 1102.3742 1109.0407 1141.0346 1157.6957 1170.7715 1172.9843 1176.1521 1185.6157 1210.8621 1221.0853 1236.5715 1268.4829 1283.9017 1289.7466 1312.3713 1321.1051 1334.1198 1373.5829 1380.2388 1387.4972 1397.2373 1404.2487 1441.7924 1452.3727 1457.2382 1472.5261 1481.3824 1485.6126 1496.9225 1588.8540 1595.6217 1601.7752 1615.5233 2866.2325 2892.0585 2937.9362 2969.5584 2971.1702 2982.1212 3036.0811 3112.7239 3125.9071 3127.3707 3139.2130 3149.5989 3154.5074 3165.9460 3167.3947 3171.0277 3427.9359 3553.9298
redmass: 6.0308 4.0523 5.7283 4.0722 5.6786 4.8352 2.2686 2.9218 4.8621 2.9771 4.9406 4.5724 4.4333 4.8120 1.3820 2.8834 3.9754 4.0443 5.7872 2.8430 2.9399 3.6910 3.9668 3.4204 2.9870 3.8480 6.3672 6.8670 4.9456 1.7653 1.7717 2.1748 2.2439 1.9527 2.6118 1.7178 1.3984 1.2922 1.2452 1.4346 1.4390 2.8858 1.6403 1.3924 1.9787 5.2685 1.3795 4.0428 2.3926 2.5212 2.0283 2.6813 2.9525 1.6927 1.3776 1.9440 4.1153 1.3302 1.1497 1.1463 1.1238 1.1345 2.6350 1.4938 1.3050 1.2233 1.1730 1.2253 1.2617 1.3207 1.5683 2.4583 4.4382 3.1197 2.0593 1.7753 2.0883 1.2088 1.1071 1.7685 1.3304 2.3532 1.0867 7.4616 6.1654 6.2658 6.1508 1.0708 1.0677 1.0843 1.0592 1.0863 1.0904 1.1033 1.0872 1.0865 1.0896 1.0923 1.0883 1.0957 1.1002 1.0955 1.0969 1.0744 1.0659
irintensity: 0.4867 0.2798 0.4048 0.3973 0.0479 1.5591 1.5916 3.2087 0.1939 6.6217 0.7525 1.5031 7.3038 0.8131 104.6010 27.2045 31.2298 2.0126 5.5961 0.4235 0.0923 11.3930 6.5388 8.0117 20.0951 16.1847 0.4930 1.4878 19.5766 66.1989 56.8352 29.9488 4.9409 64.0823 20.1724 42.8805 5.5179 12.4855 0.1270 15.6857 7.9022 36.8497 12.6859 0.2329 22.7999 0.1340 1.7730 43.0660 17.6938 12.6301 7.6473 30.8684 8.6550 8.5723 9.5614 0.1617 65.0440 57.8423 5.8474 8.9440 3.3806 3.9955 0.9717 12.2117 8.2719 2.7424 0.9976 4.1295 2.8327 12.1522 23.6928 10.5954 1.8124 2.9760 10.0915 7.4823 13.3548 37.9719 6.9643 88.3858 8.9948 10.2890 2.4828 2.2344 0.5206 4.7143 2.8644 64.6384 97.0699 40.2564 34.5512 26.1593 24.1423 55.6098 11.3541 0.9865 11.1970 29.2916 0.6774 27.5722 14.7819 8.0215 1.4929 0.2905 6.7965
temp: 298.150 k
press: 1.00000 atm
elementType: 17 8 7 6 6 6 6 6 6 6 6 6 6 6 6 6 6 6 6 1 1 1 1 1 1 1 1 1 1 1 1 1 1 1 1 1 1
symmnumber: 1
zpe: 788977.0 jmol-1
zpe.correction: 0.300505 hartree
zpe.thermalcorrener: 0.318842 hartree
zpe.thermalcorrenthalpy: 0.319786 hartree
zpe.thermalcorrgfe: 0.250352 hartree
zpe.sumelectzpe: -1209.125807 hartree
zpe.sumelectthermal: -1209.107471 hartree
zpe.sumelectthermalent: -1209.106526 hartree
zpe.sumelectthermalfe: -1209.175960 hartree
dipole: -1.2846 -0.9512 -0.8301
dipole: 1.8011
quadrupole: -154.5765 -107.9553 -116.3311
quadrupole: 5.2404 -1.1151 -0.0826
quadrupole: -28.2888 18.3323 9.9565 5.2404 -1.1151 -0.0826
hfenergy: -1209.4263125 hartree
pointgroup: C01 [X(C16H18Cl1N1O1)]
dipole: 0.4956123 0.339668 -0.3756534 debye
polarizability: 242.493036|22.0902292|183.5151294|-7.6399554|-11.5623935|137.0507247 unknown
InChI: InChI=1S/C16H18ClNO/c17-15-8-6-13(7-9-15)12-18-11-10-16(19)14-4-2-1-3-5-14/h1-9,16,18-19H,10-12H2
charge 0 multiplicity 1
37 atoms
Cl -7.506487 -0.10911 0.883346
O  3.646757 -2.787815 0.274998
N  -0.710486 -0.46431 -0.121529
C  1.516528 -1.530992 0.118348
C  2.968936 -1.667702 -0.411852
C  0.684135 -0.462809 -0.615825
C  3.814593 -0.426217 -0.163736
C  -1.600055 0.505143 -0.796729
C  -3.05098 0.355194 -0.353322
C  4.005801 0.533686 -1.187007
C  4.389988 -0.199479 1.111444
C  -3.59212 -0.925176 -0.073039
C  -3.891657 1.490032 -0.241366
C  4.747914 1.711421 -0.939331
C  5.135915 0.973502 1.359226
C  5.313501 1.935795 0.336724
C  -4.945173 -1.076332 0.303134
C  -5.250024 1.359627 0.128834
C  -5.754229 0.072974 0.395038
H  1.562828 -1.301914 1.201924
H  0.995004 -2.50422 0.006842
H  2.925296 -1.868363 -1.505804
H  0.657255 -0.695803 -1.700751
H  1.18129 0.531625 -0.513005
H  -0.748944 -0.356894 0.902432
H  -1.526448 0.306083 -1.886605
H  -1.282821 1.568529 -0.657112
H  3.583185 0.357355 -2.184558
H  4.273377 -0.962642 1.887554
H  3.071508 -3.592394 0.210013
H  -2.935216 -1.797777 -0.146394
H  -3.488563 2.489918 -0.443027
H  4.891803 2.445151 -1.740559
H  5.584588 1.135917 2.345975
H  5.894377 2.844853 0.529587
H  -5.361258 -2.064945 0.518838
H  -5.896418 2.237791 0.214496
