program: Gaussian 09
title: 000029296
version: EM64L-G09RevD.01
frameworkgroup: C1[X(C18H25N3)]
method: RPBEPBE
basis: SDD
operation: Freq
keyword: #pfreq=noraman
keyword: PBEPBE/SDD
title: #p freq=noraman PBEPBE/SDD
converged: YES YES NO NO
title: Mulliken charges:
elementType: N N N C C C C C C C C C C C C C C C C C C H H H H H H H H H H H H H H H H H H H H H H H H H
charge: -0.403507 -0.051534 -0.086775 0.197981 -0.547964 -0.382408 -0.391401 -0.391475 -0.509571 -0.036454 0.217397 0.233012 -0.084797 -0.380755 -0.384822 -0.316307 -0.340338 -0.292166 -0.234089 -0.617353 -0.615782 0.214630 0.174379 0.197446 0.209012 0.186908 0.203958 0.215206 0.202826 0.239440 0.191827 0.267437 0.208977 0.264268 0.226969 0.168230 0.248354 0.260432 0.223638 0.226917 0.224515 0.189772 0.229672 0.224849 0.188919 0.230526
chargesum: 0.00000
title: Mulliken charges with hydrogens summed into heavy atoms:
elementType: N N N C C C C C C C C C C C C C C C C C C
charge: -0.136070 -0.051534 -0.086775 0.197981 -0.158955 0.024050 -0.000535 0.026557 -0.078303 -0.036454 0.217397 0.233012 -0.084797 0.092489 0.010377 -0.067953 -0.079906 -0.068528 -0.007172 0.026606 0.028513
polarizability: 2.57351562e+02 1.14383795e+01 2.78100311e+02 -1.78719074e+01 1.53477104e+01 1.41970057e+02
1716.lowfreq: -13.9870 -6.1824 -2.8343 0.0004 0.0004 0.0006 8.7812 14.6964 39.4146
frequency: 8.4635 12.6499 39.3604 50.2621 67.5225 90.3290 133.7609 141.7574 162.4673 178.7235 198.2538 210.5797 219.4460 240.2840 263.0987 271.5708 317.3497 328.3974 335.4379 358.1001 375.9087 395.1445 421.2992 432.7998 454.8012 463.0564 482.0335 514.7506 522.4451 549.8129 557.4063 598.7476 634.2642 652.3674 674.9127 723.2635 750.1698 769.5170 792.9444 802.4016 820.9158 826.7167 835.5594 854.6817 867.8660 876.0932 904.6713 949.0634 957.4079 957.8156 988.1907 1006.3048 1023.1139 1033.1851 1033.8299 1039.8284 1062.1163 1067.9270 1085.4122 1088.5849 1093.3020 1103.1111 1119.6634 1136.7920 1138.1778 1157.5342 1169.7059 1189.6672 1203.0102 1206.7592 1239.1136 1251.1207 1251.5710 1268.3426 1269.0838 1281.2778 1304.8122 1307.9031 1319.1509 1323.9674 1332.1162 1337.8435 1355.1641 1357.1909 1372.9408 1386.1427 1394.8161 1419.1600 1429.0605 1439.6905 1443.4487 1456.7362 1458.7791 1459.1729 1460.2456 1464.1195 1465.9320 1468.3016 1473.2610 1475.0024 1485.4943 1489.7281 1497.6869 1503.0054 1552.6293 1574.4970 1619.0353 2804.0497 2850.8007 2865.2641 2953.9879 2967.3583 2967.9756 2968.8764 2973.6920 2976.0979 3012.4771 3019.7082 3022.2464 3028.8426 3028.9996 3031.6801 3038.7309 3069.5127 3080.3738 3084.1300 3087.4851 3127.1305 3144.0926 3163.4895 3173.7886 3525.5708
redmass: 3.3082 2.9250 3.8277 3.4401 3.6227 2.8310 2.9002 2.5895 2.6954 3.0979 2.2045 1.1309 3.2164 1.4923 2.2602 3.0831 3.1457 2.8154 3.4340 2.9734 2.6695 2.6989 2.3983 3.0945 2.9838 3.1042 2.4608 2.5370 1.5973 4.7991 3.5079 3.0502 4.6105 4.4782 4.8573 3.5030 2.8420 1.3871 2.7089 1.6588 2.4635 1.7553 2.7672 2.9382 2.0517 1.8596 3.2122 1.9152 1.8049 1.6251 1.3154 3.2300 2.4022 1.9454 1.8274 2.0153 2.3141 1.8976 2.1502 1.3916 2.0454 2.0476 2.0448 1.4300 1.5180 1.4096 1.4605 1.5539 1.3617 1.3739 2.2056 1.3795 1.5021 1.3489 2.2155 1.6147 1.2255 1.4442 1.5312 1.6441 2.0545 1.3830 1.6173 1.5380 1.4539 3.2378 3.0543 1.1497 3.0287 1.1801 2.6069 1.4161 1.1180 1.2241 1.0557 1.0793 1.1640 1.1200 1.1069 1.0658 1.0590 1.1386 1.1995 3.2581 6.0417 3.9141 6.2191 1.0704 1.0571 1.0570 1.0615 1.0677 1.0630 1.0657 1.0634 1.0622 1.0978 1.0952 1.0729 1.0874 1.0894 1.0841 1.1022 1.0940 1.1003 1.0967 1.1003 1.0855 1.0901 1.0955 1.0970 1.0736
irintensity: 0.2625 0.3144 0.4458 0.2309 1.6846 0.1579 0.0576 2.0862 1.2667 2.3758 0.5486 1.2060 0.8238 0.8412 0.2943 1.9458 8.2381 2.1867 3.8433 5.3577 2.7330 2.3540 2.5830 3.4794 8.8938 4.2003 0.4521 2.2986 45.4236 4.8176 6.9869 19.7113 8.3057 17.5849 2.8517 3.8810 0.7433 91.1842 0.4480 9.8523 8.5458 8.2569 5.4449 1.6555 6.8055 6.2271 4.3287 0.1648 10.5958 13.2706 0.4507 1.4400 13.5876 1.5231 29.8881 17.0565 40.3650 5.9929 0.4440 10.9199 33.4493 7.3997 6.9661 15.4741 4.2736 3.8991 2.3585 2.5661 13.7896 13.7891 1.3687 4.2702 4.1401 3.5679 14.4509 1.6758 7.0862 10.6842 6.4888 3.1131 19.9463 0.2190 1.7324 1.2034 4.5240 70.8464 5.2216 8.0014 82.1679 2.6451 2.2415 54.8031 1.9380 0.6747 14.6499 11.6841 15.2451 14.1742 21.1625 16.2155 5.5718 28.5252 23.8406 179.8784 28.6727 175.8740 11.8947 95.3284 69.7419 228.8198 32.5479 60.0019 43.8335 15.5887 43.6409 37.1833 79.3389 59.7457 36.6624 38.6362 35.1521 9.9000 107.4685 17.0930 13.2280 40.0427 43.5124 4.6551 15.3542 24.3730 24.9667 14.4952
temp: 298.150 k
press: 1.00000 atm
elementType: 7 7 7 6 6 6 6 6 6 6 6 6 6 6 6 6 6 6 6 6 6 1 1 1 1 1 1 1 1 1 1 1 1 1 1 1 1 1 1 1 1 1 1 1 1 1
symmnumber: 1
zpe: 1040432.7 jmol-1
zpe.correction: 0.396280 hartree
zpe.thermalcorrener: 0.416479 hartree
zpe.thermalcorrenthalpy: 0.417423 hartree
zpe.thermalcorrgfe: 0.344899 hartree
zpe.sumelectzpe: -863.580269 hartree
zpe.sumelectthermal: -863.560071 hartree
zpe.sumelectthermalent: -863.559127 hartree
zpe.sumelectthermalfe: -863.631650 hartree
dipole: 4.1112 -3.2243 -0.9178
dipole: 5.3048
quadrupole: -121.9669 -118.6138 -128.7901
quadrupole: 2.6189 -1.8170 1.3016
quadrupole: 1.1567 4.5098 -5.6665 2.6189 -1.8170 1.3016
hfenergy: -863.9765493 hartree
pointgroup: C01 [X(C18H25N3)]
dipole: -1.3468687 1.5440778 -0.3970009 debye
polarizability: 261.5555089|14.8954914|273.0457806|17.1509572|-18.729847|142.8206409 unknown
InChI: InChI=1S/C18H25N3/c1-21(2)13-12-19-18-14-8-4-3-5-10-16(14)20-17-11-7-6-9-15(17)18/h6-7,9,11,19H,3-5,8,10,12-13H2,1-2H3
charge 0 multiplicity 1
46 atoms
N  -1.10865 0.347661 -1.087868
N  2.525709 -1.402282 0.351553
N  -4.424727 1.40777 0.418106
C  1.309572 0.484305 -0.672262
C  1.395435 1.930764 -1.144245
C  1.614781 2.966532 0.00115
C  3.092354 3.103853 0.440264
C  3.746679 1.813487 0.988229
C  3.797288 0.630527 -0.021618
C  2.490275 -0.141188 -0.139626
C  0.089902 -0.250566 -0.671723
C  0.124094 -1.647715 -0.267652
C  1.366265 -2.158947 0.271576
C  -2.440395 0.15821 -0.474795
C  -3.031422 1.528375 -0.056149
C  -0.968354 -2.561106 -0.435831
C  1.433513 -3.519155 0.714889
C  -0.866686 -3.893575 -0.023757
C  0.336235 -4.372505 0.580819
C  -5.409482 1.291736 -0.676414
C  -4.80286 2.450767 1.393444
H  2.228942 2.030551 -1.868942
H  0.493624 2.226404 -1.713377
H  1.264043 3.959982 -0.344019
H  0.984453 2.686547 0.868326
H  3.684519 3.456009 -0.431092
H  3.165438 3.89921 1.209335
H  3.2237 1.480729 1.906488
H  4.785162 2.056399 1.288811
H  4.55504 -0.100593 0.307075
H  4.116464 1.018677 -1.0114
H  -1.003962 1.247467 -1.560145
H  -3.136567 -0.349984 -1.172341
H  -2.35352 -0.474025 0.423052
H  -2.411172 1.935886 0.763824
H  -2.943696 2.247783 -0.916551
H  -1.882622 -2.230087 -0.934959
H  2.384959 -3.858035 1.136665
H  -1.70936 -4.576949 -0.176662
H  0.402461 -5.414236 0.914184
H  -5.143875 0.457316 -1.347476
H  -5.485891 2.222253 -1.295538
H  -6.407769 1.077688 -0.255226
H  -5.813396 2.237649 1.786203
H  -4.814956 3.48416 0.962459
H  -4.099644 2.440746 2.24462
