program: Gaussian 09
title: 000029300
version: EM64L-G09RevD.01
frameworkgroup: C1[X(C19H26ClN3)]
method: RPBEPBE
basis: SDD
operation: Freq
keyword: #p
keyword: freq=noraman
keyword: PBEPBE/SDD
title: #p freq=noraman PBEPBE/SDD
converged: YES YES NO NO
title: Mulliken charges:
elementType: Cl N N N C C C C C C C C C C C C C C C C C C C H H H H H H H H H H H H H H H H H H H H H H H H H H
charge: -0.080496 -0.407659 -0.047347 -0.097169 0.186428 -0.552018 -0.377148 -0.393835 -0.391395 -0.510535 -0.030051 0.234442 0.263462 -0.102593 -0.361299 -0.483236 -0.234645 -0.331631 -0.327305 -0.191138 -0.241753 -0.616784 -0.608819 0.216763 0.177423 0.200518 0.200747 0.188493 0.205338 0.213638 0.204821 0.240405 0.193255 0.269372 0.207081 0.277656 0.217999 0.199526 0.193016 0.215048 0.275049 0.266138 0.255444 0.189081 0.228537 0.224382 0.225554 0.187985 0.229255
chargesum: 0.00000
title: Mulliken charges with hydrogens summed into heavy atoms:
elementType: Cl N N N C C C C C C C C C C C C C C C C C C C
charge: -0.080496 -0.138288 -0.047347 -0.097169 0.186428 -0.157832 0.024117 -0.000003 0.027064 -0.076874 -0.030051 0.234442 0.263462 -0.102593 0.123437 -0.065711 0.040404 0.076433 -0.061167 -0.191138 0.013691 0.025217 0.033975
polarizability: 3.23593059e+02 -1.08762859e+01 2.34581877e+02 -1.10884624e+01 -3.71527069e+01 1.78910002e+02
1716.lowfreq: 0.0015 0.0022 0.0023 2.4737 6.0714 8.7556 16.5544 24.2705 30.1907
frequency: 16.0198 23.6747 30.1739 41.4144 56.5355 69.6237 91.0348 104.6311 136.0908 161.9979 176.4466 194.6810 205.9847 222.3715 227.3064 236.7975 258.8678 288.9618 308.4359 309.5683 339.6940 350.1768 360.1248 364.8566 390.9333 400.9149 407.1470 414.9035 443.2829 469.7867 495.3203 506.3115 513.2789 529.7089 560.3145 565.9287 617.7509 654.3526 662.7539 698.0717 715.2654 739.0925 758.1577 781.9988 828.8897 830.7307 833.7112 839.6181 855.4707 873.6703 875.8020 886.1482 903.5019 950.8282 954.6354 961.0119 967.3063 1005.2603 1036.2442 1037.7753 1046.7699 1068.9985 1072.2548 1078.6578 1081.3903 1091.6145 1100.8419 1107.8712 1120.9142 1133.5403 1138.1875 1161.4096 1177.9652 1203.8678 1207.1541 1213.1419 1239.3722 1252.2953 1265.1575 1267.4262 1269.1648 1275.7510 1298.4604 1309.9625 1323.1021 1324.0331 1335.9273 1347.8709 1354.2230 1354.4485 1356.2938 1372.0320 1381.2945 1390.3625 1409.2309 1418.0497 1437.4173 1440.0292 1450.5356 1457.0976 1459.6143 1462.0238 1463.6242 1466.0126 1469.4933 1472.3529 1475.6573 1478.1523 1482.6256 1484.9604 1498.7108 1504.9858 1545.4175 1569.8239 1608.0248 2842.6141 2849.3235 2866.0306 2955.4200 2956.0471 2964.7131 2971.7888 2974.9245 2975.5188 2977.5495 3013.3201 3018.3950 3019.5836 3020.0641 3026.0785 3029.1970 3039.0373 3042.6633 3064.8408 3071.0005 3077.2104 3084.5843 3155.2362 3176.7655 3196.2269 3533.2723
redmass: 4.0312 4.1172 2.7794 5.5356 3.5421 3.1906 3.8969 4.4024 5.3078 2.9403 2.3477 3.6279 2.2321 1.4472 1.5489 2.2736 2.8338 3.1144 2.4865 4.1643 3.4436 2.8129 3.0689 2.3909 2.3538 3.6510 2.7989 2.0244 3.3872 2.6788 1.8140 2.2596 2.1689 3.5540 3.5653 3.7589 3.4907 6.5178 5.7833 5.7422 3.5546 2.4593 2.9271 2.6911 1.8846 1.8335 1.8504 2.6715 2.6614 1.6282 2.1417 2.4965 3.0008 1.8627 2.0351 2.2445 1.3326 2.0933 1.5231 2.2911 2.3075 1.9645 2.1473 1.8051 1.6399 1.6939 2.2491 2.1241 1.9303 1.3709 1.4148 1.8468 1.9573 1.3771 1.3972 1.3177 2.2227 1.2644 1.6735 1.5793 1.9699 1.4216 1.2914 1.5845 1.6232 1.8937 1.4052 1.3798 1.4468 1.4355 1.6559 1.4054 2.3070 4.5529 3.1816 1.1437 3.7316 1.1629 1.5782 1.0924 1.0767 1.1108 1.1257 1.1076 1.1154 1.1620 1.0615 1.1252 1.1172 1.0622 3.7486 1.1820 6.3236 3.9319 6.9447 1.0693 1.0570 1.0586 1.0668 1.0608 1.0617 1.0665 1.0631 1.0662 1.0620 1.0982 1.0828 1.0780 1.0955 1.1025 1.0726 1.1025 1.0943 1.0957 1.0943 1.1009 1.1004 1.0878 1.0980 1.0911 1.0738
irintensity: 0.4908 0.0153 0.4466 0.1206 0.1461 0.2187 0.3932 0.7383 0.1645 0.3062 2.1090 4.0476 0.2156 0.4373 2.0534 0.4069 1.2411 0.3214 6.9102 5.3821 6.4591 1.6163 1.6285 1.4721 6.2899 7.0855 1.2917 0.9825 10.8411 11.1504 36.7088 0.0126 24.2806 12.1214 7.5896 17.9574 16.5461 13.3973 9.8525 10.1754 0.9036 22.9344 6.2228 0.8854 13.5335 26.6757 25.0700 13.6291 5.9165 14.2427 12.1732 8.3853 4.3250 2.1089 19.5236 14.4141 1.0322 23.2411 9.6162 14.4047 7.2891 13.4888 13.6933 8.5790 8.7738 1.1106 4.1383 20.9040 3.7747 2.6842 8.4932 1.0747 26.5478 7.2987 32.7656 15.5413 1.6292 4.5111 2.1270 1.4476 10.9220 3.1392 3.7543 15.1783 6.4097 12.5059 2.2115 3.4082 16.1930 6.2394 1.0260 21.8501 65.6479 1.8333 4.3721 2.9647 30.7544 9.2396 53.2642 7.7923 10.6271 4.7009 9.0095 17.5110 9.2551 3.8958 4.1767 53.7566 53.9455 16.7430 166.7846 27.1475 39.8994 148.0200 7.3644 50.6076 73.8472 265.5303 56.7447 28.3707 35.5725 31.4938 16.5754 83.2741 32.0004 75.8129 2.4593 42.4616 53.2145 34.8897 30.0285 113.3937 61.5085 12.4546 16.2558 33.4914 37.5871 0.3573 8.0504 2.6185 13.7975
temp: 298.150 k
press: 1.00000 atm
elementType: 17 7 7 7 6 6 6 6 6 6 6 6 6 6 6 6 6 6 6 6 6 6 6 1 1 1 1 1 1 1 1 1 1 1 1 1 1 1 1 1 1 1 1 1 1 1 1 1 1
symmnumber: 1
zpe: 1089907.8 jmol-1
zpe.correction: 0.415124 hartree
zpe.thermalcorrener: 0.437686 hartree
zpe.thermalcorrenthalpy: 0.438630 hartree
zpe.thermalcorrgfe: 0.361612 hartree
zpe.sumelectzpe: -1362.196190 hartree
zpe.sumelectthermal: -1362.173628 hartree
zpe.sumelectthermalent: -1362.172683 hartree
zpe.sumelectthermalfe: -1362.249701 hartree
dipole: 4.0481 4.2743 -1.1888
dipole: 6.0059
quadrupole: -148.6752 -140.8394 -141.8399
quadrupole: -0.6705 -4.7225 -2.1874
quadrupole: -4.8904 2.9454 1.9450 -0.6705 -4.7225 -2.1874
hfenergy: -1362.6113136 hartree
pointgroup: C01 [X(C19H26Cl1N3)]
dipole: -0.387603 -2.2850626 -0.4598788 debye
polarizability: 305.9767752|37.118976|252.3441745|-11.9661645|36.7090465|178.7639875 unknown
InChI: InChI=1S/C19H26ClN3/c1-23(2)12-6-11-21-19-15-7-4-3-5-8-17(15)22-18-10-9-14(20)13-16(18)19/h9-10,13,21H,3-8,11-12H2,1-2H3
charge 0 multiplicity 1
49 atoms
Cl 4.205416 3.357022 -0.268646
N  0.649959 -0.676188 -1.697392
N  -1.606803 2.090414 0.669811
N  1.921498 -2.917079 1.098021
C  -1.498979 0.148241 -0.846625
C  -2.28601 -0.975508 -1.511527
C  -2.847515 -2.041567 -0.519643
C  -4.172078 -1.622828 0.160902
C  -4.101846 -0.335836 1.01582
C  -3.699615 0.944943 0.228465
C  -2.202569 1.081446 -0.010087
C  -0.082506 0.266349 -0.96994
C  0.564593 1.414087 -0.351192
C  -0.245856 2.270817 0.488345
C  2.014238 -1.17721 -1.414954
C  2.041356 -2.722378 -1.410026
C  1.931383 1.780269 -0.581055
C  1.311848 -3.32738 -0.188043
C  0.361475 3.390907 1.143474
C  2.463779 2.896168 0.057739
C  1.706474 3.708544 0.945552
C  3.208269 -3.585929 1.37564
C  0.985763 -3.025566 2.23606
H  -3.138939 -0.543184 -2.07292
H  -1.68335 -1.497424 -2.278535
H  -3.027232 -2.984407 -1.074383
H  -2.080204 -2.263049 0.249435
H  -4.940998 -1.480896 -0.628125
H  -4.528247 -2.458851 0.796084
H  -3.396329 -0.475352 1.858559
H  -5.100002 -0.166836 1.465738
H  -4.00049 1.838082 0.801516
H  -4.254202 0.963701 -0.732865
H  0.09189 -1.316099 -2.264259
H  2.739226 -0.800724 -2.166014
H  2.331649 -0.833865 -0.415536
H  3.097737 -3.051834 -1.428983
H  1.581981 -3.118857 -2.340271
H  1.27515 -4.442492 -0.296209
H  0.263737 -2.97167 -0.188745
H  2.550387 1.223287 -1.28496
H  -0.278912 4.000241 1.788047
H  2.167866 4.569143 1.437962
H  3.108329 -4.695576 1.493104
H  3.640816 -3.18016 2.307236
H  3.92929 -3.393456 0.562703
H  1.463816 -2.623516 3.147234
H  0.664717 -4.076325 2.452496
H  0.082242 -2.422717 2.033991
