program: Gaussian 09
title: 000029271
version: EM64L-G09RevD.01
frameworkgroup: C1[X(C9H13NO3)]
method: RPBEPBE
basis: SDD
operation: Freq
keyword: #p
keyword: freq=noraman
keyword: PBEPBE/SDD
title: #p freq=noraman PBEPBE/SDD
converged: YES YES NO NO
title: Mulliken charges:
elementType: O O O N C C C C C C C C C H H H H H H H H H H H H H
charge: -0.455793 -0.490989 -0.428492 -0.575370 -0.206363 -0.101690 0.489445 -0.715939 -0.620260 -0.381978 0.186815 -0.313270 0.133847 0.176711 0.228546 0.236856 0.255253 0.185503 0.235743 0.270329 0.283792 0.255789 0.252712 0.342178 0.372786 0.383840
chargesum: 0.00000
title: Mulliken charges with hydrogens summed into heavy atoms:
elementType: O O O N C C C C C C C C C
charge: -0.113615 -0.118203 -0.044652 -0.035789 -0.029652 0.126856 0.489445 -0.038328 -0.384517 -0.111650 0.186815 -0.060559 0.133847
polarizability: 1.58531607e+02 4.81004928e+00 1.11445655e+02 -7.38722825e+00 1.28913682e+01 7.90374554e+01
1716.lowfreq: -7.2140 -0.0006 0.0002 0.0006 2.8894 13.3274 41.3823 60.0076 75.1304
frequency: 39.8080 59.9797 75.1243 165.7286 174.3685 224.1548 242.9747 265.3731 266.8057 270.9299 283.1826 286.8340 323.5043 355.5247 386.3573 429.7831 440.8322 455.5399 482.9732 487.8859 538.7396 566.4261 607.8392 626.0385 720.1967 755.9421 770.7489 823.4819 835.3377 864.8505 911.1470 933.0847 951.5375 982.2160 991.9907 1070.0584 1078.0564 1127.1038 1147.5074 1159.5853 1179.1637 1191.0894 1225.9246 1240.2541 1276.6769 1280.7049 1297.3798 1335.8480 1340.8104 1358.1654 1384.2316 1412.9241 1430.1720 1471.6703 1477.6507 1517.1944 1611.9356 1621.3886 1632.0390 2917.0373 2972.8270 3002.8976 3073.8100 3108.1632 3117.4768 3147.4689 3172.3299 3462.2088 3527.6933 3556.5983 3595.2244 3623.0657
redmass: 4.5968 3.6361 3.9652 5.6442 5.4208 5.1109 1.0674 1.2120 1.0622 3.0949 2.8970 3.6565 1.3396 3.5583 3.3345 3.0623 3.3006 3.2639 2.0195 1.4060 1.6077 6.5137 5.3709 4.5959 3.5657 6.0228 4.3012 1.5389 1.5111 1.9150 4.3618 2.0697 1.3345 1.7663 2.2173 2.1977 1.8274 1.3131 2.0918 1.4551 1.3815 1.4301 2.5258 1.6305 1.4934 1.8492 1.3374 1.2137 1.6542 1.6749 1.2305 3.8669 3.9386 1.0490 1.0487 3.2358 6.4292 7.0439 1.1023 1.0836 1.0435 1.0834 1.0927 1.0911 1.1000 1.0885 1.0962 1.0440 1.0649 1.0662 1.0986 1.0666
irintensity: 1.2083 0.4528 0.2817 0.2905 2.0042 1.2210 1.7549 166.6732 39.2919 10.3430 15.7097 5.8199 149.8871 19.8592 18.3716 23.3475 8.4157 4.4253 14.0133 139.2643 320.5655 26.9943 9.8464 23.5670 3.4279 18.8044 1.6669 53.7956 8.7663 6.3281 64.5306 20.1301 0.6161 9.5062 25.7201 73.2849 112.0432 16.8555 26.6163 3.2092 205.1327 38.5552 126.1366 0.1681 54.9429 43.3161 24.8940 2.8862 17.2801 3.6311 27.1451 22.9050 49.1854 12.4013 7.3110 81.6993 24.7485 16.5703 30.9970 51.2186 31.4136 35.2135 42.3107 11.8693 13.6864 3.1095 4.7993 0.5569 87.7103 2.9940 0.6867 49.9591
temp: 298.150 k
press: 1.00000 atm
elementType: 8 8 8 7 6 6 6 6 6 6 6 6 6 1 1 1 1 1 1 1 1 1 1 1 1 1
symmnumber: 1
zpe: 548736.5 jmol-1
zpe.correction: 0.209003 hartree
zpe.thermalcorrener: 0.222823 hartree
zpe.thermalcorrenthalpy: 0.223768 hartree
zpe.thermalcorrgfe: 0.169125 hartree
zpe.sumelectzpe: -630.164596 hartree
zpe.sumelectthermal: -630.150775 hartree
zpe.sumelectthermalent: -630.149831 hartree
zpe.sumelectthermalfe: -630.204473 hartree
dipole: 1.1318 2.9920 2.6469
dipole: 4.1520
quadrupole: -87.8387 -68.2874 -79.0363
quadrupole: 4.6482 0.4904 5.5629
quadrupole: -9.4513 10.1001 -0.6489 4.6482 0.4904 5.5629
hfenergy: -630.3735985 hartree
pointgroup: C01 [X(C9H13N1O3)]
dipole: -0.4510432 1.5056428 -0.4450362 debye
dipolederiv: -0.5537909 -0.041403 0.2492419 -0.0517297 -0.5130182 -0.1786793 0.3370918 -0.1620464 -0.6732987 -0.7127859 0.5978474 0.0149027 0.6915018 -0.8653005 -0.1015012 0.029243 -0.1034062 -0.4295909 -1.5133608 -0.1180114 0.1837691 -0.1230685 -0.1295248 0.0144897 0.2110669 0.0154051 -0.4437816 -0.5292406 0.083872 -0.1690964 0.140958 -0.2509757 -0.0051837 -0.3357766 -0.116633 -0.9047554 0.3463155 0.0261324 -0.1777983 0.1038892 0.4391182 0.139557 -0.3079409 0.0931699 0.4390973 0.2761845 -0.0942128 -0.0190328 -0.0365132 0.2766442 0.1603205 0.3530071 0.1323395 0.5236951 -0.0112451 -0.0228021 0.0669616 0.0300276 -0.0848386 -0.0482678 -0.0451077 -0.0118132 -0.1755769 -0.1618386 0.0052499 0.0453314 0.0171908 0.1108027 -0.025305 -0.0854656 -0.0573005 -0.0097417 -0.0690156 0.119269 -0.0213145 -0.0229996 -0.0345768 0.0074544 0.0355832 -0.0310606 -0.164176 -0.075859 0.0778657 -0.0314207 -0.085051 0.0142965 0.0029285 -0.059471 -0.0411732 -0.174518 0.2604712 -0.4813292 -0.018664 -0.926236 0.7559529 0.1281888 -0.0195911 0.0786926 0.0376407 -0.1240165 -0.0790743 -0.0079334 0.1644577 0.1153944 -0.0353967 -0.0040721 0.0100928 -0.1476557 1.338399 0.0771081 -0.2267335 0.3725536 -0.1251908 -0.0595825 -0.2557886 -0.0099235 0.0924463 -0.0087603 -0.0000151 0.0212366 -0.056117 -0.225805 0.0374946 0.0125449 0.0198582 -0.016996 0.0341032 -0.059784 0.0088324 -0.0356799 -0.1460704 0.024717 0.0095234 0.0148281 0.0007635 -0.0674034 0.0119561 -0.1019267 0.008636 0.0814788 0.0426995 -0.153955 0.0474722 -0.0463028 0.1179516 0.0217748 0.0613336 0.0473192 0.0386424 -0.0829889 0.0976346 -0.0764722 -0.0082241 0.053188 0.0232284 0.0065255 -0.0807592 -0.1814832 0.0607303 0.0180814 0.0541752 0.077691 0.0759579 -0.0553963 0.0266804 -0.0418643 -0.0913513 0.0164095 0.0224236 0.0170779 0.1477166 0.0483507 0.086491 0.0190215 0.0821301 0.0186946 -0.0031059 0.0142354 -0.0055275 0.1490281 0.0382692 -0.0004257 0.143266 0.0063979 0.1382102 -0.0962147 0.1541358 -0.0221366 0.3389908 0.2638291 0.0136725 0.0990099 -0.0509781 -0.000497 -0.0283167 0.1518269 0.1105771 0.252981 0.0620644 -0.0618854 0.0197797 -0.0657406 -0.0294183 0.0154952 0.0292353 0.0147401 0.1595053 0.2028303 0.0190386 -0.2222006 0.0631049 0.263407 -0.0192263 -0.2328139 -0.0093904 0.1948287 0.2480134 -0.18278 0.0400741 -0.1484164 0.2631447 0.0297061 0.0376546 0.0401197 0.3880922 0.461389 0.0336131 -0.0098453 -0.0030134 0.162264 0.0035777 -0.0133052 -0.0016649 0.3921414 unknown
polarizability: 158.1916393|-1.2682913|115.572219|-10.196631|3.9830841|75.2508588 unknown
InChI: InChI=1S/C9H13NO3/c1-5(10)9(13)6-2-3-7(11)8(12)4-6/h2-5,9,11-13H,10H2,1H3
charge 0 multiplicity 1
26 atoms
O  2.292923 -0.748457 -1.709141
O  -2.938701 1.812255 0.164014
O  -3.804999 -0.733529 0.404748
N  2.276331 0.793935 1.729562
C  1.780462 0.188287 -0.68628
C  2.675355 -0.037122 0.582768
C  0.300314 -0.048744 -0.416278
C  4.157153 0.219056 0.25456
C  -0.592436 1.045085 -0.272243
C  -0.203429 -1.368796 -0.280126
C  -1.951819 0.810191 0.002552
C  -1.569122 -1.600682 -0.006157
C  -2.451139 -0.512284 0.137904
H  1.93019 1.240272 -1.025098
H  2.551414 -1.100785 0.865726
H  4.781652 -0.025826 1.130645
H  4.47364 -0.390197 -0.606647
H  4.323372 1.285979 0.001393
H  -0.220308 2.072275 -0.386515
H  0.481961 -2.214873 -0.394205
H  1.308686 0.675155 2.042276
H  2.563217 1.775036 1.667858
H  -1.967898 -2.614044 0.098701
H  1.643678 -0.785675 -2.456786
H  -2.567602 2.719926 0.055542
H  -4.266293 0.14386 0.471125
