program: Gaussian 09
title: 000029306
version: EM64L-G09RevD.01
frameworkgroup: C1[X(C15H13N3O2)]
method: RPBEPBE
basis: SDD
operation: Freq
keyword: #p
keyword: freq=noraman
keyword: PBEPBE/SDD
title: #p freq=noraman PBEPBE/SDD
converged: YES YES NO NO
title: Mulliken charges:
elementType: O O N N N C C C C C C C C C C C C C C C H H H H H H H H H H H H H
charge: -0.258003 -0.262328 -0.118023 -0.361609 -0.437884 -0.524347 0.155273 0.325940 0.521138 0.161858 0.162667 -0.324952 -0.391282 -0.439458 -0.364293 -0.254010 -0.206653 -0.215997 -0.221873 -0.240698 0.221700 0.275201 0.331375 0.328629 0.271565 0.233187 0.230534 0.241134 0.237378 0.235097 0.228510 0.229325 0.230898
chargesum: 0.00000
title: Mulliken charges with hydrogens summed into heavy atoms:
elementType: O O N N N C C C C C C C C C C C C C C C
charge: -0.258003 -0.262328 -0.118023 -0.030234 -0.109255 -0.027446 0.155273 0.325940 0.521138 0.161858 0.162667 -0.053387 -0.158095 -0.208924 -0.123159 -0.016632 0.028444 0.012512 0.007452 -0.009800
polarizability: 2.09713418e+02 9.51672572e+00 2.02556918e+02 3.92491372e+01 -2.60248566e-01 1.34295290e+02
1716.lowfreq: -8.2766 -4.6565 -0.0003 0.0003 0.0006 5.2371 22.4993 27.9107 32.8223
frequency: 22.2813 27.8666 32.8216 66.2817 94.1788 127.5442 134.7155 212.7303 221.6794 240.8805 269.3533 293.5174 332.7410 362.5280 378.8693 404.4330 418.7588 442.6006 468.1752 506.7082 534.2704 549.1848 561.1358 597.7622 615.9150 618.2906 660.6318 667.6373 694.0400 703.3148 715.5387 734.0913 758.4315 761.0936 778.5874 809.3997 837.5190 854.7692 873.3698 889.0176 911.6582 962.1137 974.2877 979.9543 990.9866 991.1837 999.3029 1026.4208 1038.4336 1079.8125 1087.2983 1113.8337 1132.7098 1173.7341 1176.7923 1185.9226 1187.3205 1216.7225 1228.4624 1254.8334 1266.8952 1310.5200 1333.4076 1357.1587 1370.4386 1388.2489 1390.6900 1423.1960 1438.3883 1448.5889 1458.7562 1471.6155 1486.4375 1487.3489 1578.3641 1597.4030 1606.4153 1616.5789 1619.3215 1636.3201 2957.9916 3046.7243 3114.5211 3123.7302 3124.6274 3136.4615 3144.1920 3148.1436 3155.8897 3165.2514 3173.7102 3477.7075 3524.3923
redmass: 5.3008 4.1208 5.6280 6.5805 6.1992 5.1346 6.0731 5.2663 4.7944 4.9957 6.0547 5.3344 2.3818 5.3379 7.6169 2.8076 4.8987 4.4393 3.5785 2.3455 5.9555 1.7732 3.6688 3.4469 6.4025 4.6191 3.4447 4.1337 5.3478 2.0220 4.3426 2.0301 2.0590 3.4883 1.5394 4.1067 4.2358 1.2502 1.5952 4.4739 1.3724 1.3827 2.0098 1.4003 2.9819 1.7517 1.3463 2.2295 2.6253 1.9314 2.8088 2.4144 2.2218 1.0544 1.0679 2.0486 1.1856 2.7754 1.8429 2.6014 1.5930 1.5679 1.9488 1.5633 3.0327 5.5335 6.1278 2.0108 2.1501 2.1149 2.5814 1.1840 2.4134 2.1328 7.0242 6.1278 5.5046 6.2220 6.1509 4.4747 1.0683 1.0919 1.0881 1.0880 1.0860 1.0908 1.0889 1.0960 1.0936 1.1015 1.1004 1.0771 1.0752
irintensity: 0.2934 0.1355 0.0495 3.5996 2.6248 0.1555 0.8126 2.3944 1.4397 1.7526 14.9769 9.2542 2.2159 2.8877 1.7098 0.2717 10.7297 8.3246 21.9965 4.2285 9.1175 73.2142 41.6374 7.0346 0.5230 14.5720 77.7966 17.0463 11.1431 60.9939 12.9706 41.1810 28.6613 43.7098 100.1672 4.8055 8.9653 0.2556 1.0482 0.9295 1.6729 4.2104 16.4174 0.6208 0.4614 0.4744 1.9438 7.0870 5.8395 3.5507 7.2074 10.9058 24.3776 0.0545 1.6319 15.7329 2.1117 4.7259 119.1368 66.7880 8.8022 20.6642 11.5954 8.0337 171.5875 62.0608 108.7970 40.4197 129.4094 41.1640 50.3255 52.5322 4.9185 13.6572 11.4303 7.6286 214.4706 21.3321 83.0206 402.6907 47.5884 4.3845 9.1725 6.6149 2.1459 10.1437 7.9868 38.6928 8.5537 20.2027 18.4676 17.9029 35.3303
temp: 298.150 k
press: 1.00000 atm
elementType: 8 8 7 7 7 6 6 6 6 6 6 6 6 6 6 6 6 6 6 6 1 1 1 1 1 1 1 1 1 1 1 1 1
symmnumber: 1
zpe: 667300.2 jmol-1
zpe.correction: 0.254161 hartree
zpe.thermalcorrener: 0.270401 hartree
zpe.thermalcorrenthalpy: 0.271345 hartree
zpe.thermalcorrgfe: 0.208404 hartree
zpe.sumelectzpe: -892.702459 hartree
zpe.sumelectthermal: -892.686220 hartree
zpe.sumelectthermalent: -892.685275 hartree
zpe.sumelectthermalfe: -892.748216 hartree
dipole: -0.2609 -0.5804 -1.7376
dipole: 1.8504
quadrupole: -94.9807 -117.8913 -123.5554
quadrupole: 0.2674 11.9025 13.9659
quadrupole: 17.1618 -5.7488 -11.4129 0.2674 11.9025 13.9659
hfenergy: -892.9566201 hartree
pointgroup: C01 [X(C15H13N3O2)]
dipole: 0.0054055 0.1012728 -0.7209109 debye
polarizability: 196.7017236|0.8123362|200.3334|-49.8830944|-8.4891813|149.5305023 unknown
InChI: InChI=1S/C15H13N3O2/c19-14-12-8-4-5-9-13(12)16-15(20)18(17-14)10-11-6-2-1-3-7-11/h1-9,16-17H,10H2
charge 0 multiplicity 1
33 atoms
O  0.175959 -3.452089 -0.345454
O  1.082215 1.531101 2.290323
N  -0.294042 -1.375852 0.64962
N  0.189121 -0.483786 1.632448
N  1.890426 -1.879251 -0.107811
C  -1.759928 -1.572377 0.604558
C  1.828442 0.626933 0.161776
C  2.306386 -0.56149 -0.46765
C  -2.522881 -0.311193 0.21893
C  0.561763 -2.320983 0.067771
C  0.995075 0.628637 1.40298
C  2.310695 1.88667 -0.281368
C  3.284097 -0.452407 -1.495609
C  -3.70624 0.035286 0.91407
C  -2.091834 0.505014 -0.856604
C  3.252606 1.988928 -1.319618
C  3.752177 0.805335 -1.917391
C  -4.45603 1.172922 0.537373
C  -2.835592 1.644656 -1.231196
C  -4.021915 1.981395 -0.537153
H  -2.122534 -1.950752 1.584067
H  -1.921224 -2.386546 -0.125472
H  -0.227681 -0.567212 2.566991
H  2.488944 -2.635564 -0.45209
H  1.949168 2.775918 0.245215
H  3.661197 -1.364051 -1.975059
H  -4.044751 -0.584908 1.753918
H  -1.17019 0.24966 -1.393192
H  3.610062 2.969441 -1.64875
H  4.500863 0.862393 -2.714951
H  -5.369813 1.430454 1.084302
H  -2.491032 2.270545 -2.061974
H  -4.597505 2.867171 -0.8279
