program: Gaussian 09
title: 000029315
version: EM64L-G09RevD.01
frameworkgroup: C1[X(C18H23NO3)]
method: RPBEPBE
basis: SDD
operation: Freq
keyword: #p
keyword: freq=noraman
keyword: PBEPBE/SDD
title: #p freq=noraman PBEPBE/SDD
converged: YES YES NO NO
title: Mulliken charges:
elementType: O O O N C C C C C C C C C C C C C C C C C C H H H H H H H H H H H H H H H H H H H H H H H
charge: -0.459871 -0.286787 -0.286932 -0.323961 -0.107224 -0.226521 -0.497450 -0.710879 0.422731 0.480398 -0.440255 -0.371924 -0.593168 -0.393427 0.247853 -0.233233 -0.232821 -0.325881 0.179968 -0.241696 -0.535109 -0.520441 0.193264 0.218985 0.277788 0.195100 0.217841 0.230190 0.231187 0.215219 0.254697 0.268048 0.338223 0.242717 0.263892 0.227450 0.223438 0.249464 0.226784 0.226196 0.219662 0.243370 0.208746 0.227924 0.256446
chargesum: 0.00000
title: Mulliken charges with hydrogens summed into heavy atoms:
elementType: O O O N C C C C C C C C C C C C C C C C C C
charge: -0.121648 -0.286787 -0.286932 -0.046172 0.086040 -0.007536 -0.084509 -0.034282 0.422731 0.480398 -0.185558 -0.103876 -0.350450 -0.129535 0.247853 -0.005784 -0.009382 -0.076417 0.179968 -0.014913 0.154118 0.172674
polarizability: 2.67842668e+02 -1.89491227e+01 2.02377331e+02 5.24312686e+00 -3.90823595e+00 1.69399033e+02
1716.lowfreq: -10.0956 -4.9219 -1.0275 -0.0008 -0.0007 -0.0007 13.5202 17.7466 35.0025
frequency: 13.1092 17.3333 34.9035 40.4250 63.9126 74.9772 91.5019 95.4580 106.3106 124.1890 163.4115 168.7305 188.5458 198.0614 209.8386 214.6931 221.6514 246.0722 258.5132 277.9337 290.4111 303.7850 328.9033 375.1926 383.2318 401.7274 408.1358 450.2792 468.9473 484.2558 506.5636 536.4863 560.1267 583.5038 612.6894 615.8961 647.8209 697.7405 715.0965 719.0488 724.6439 737.5158 757.6030 795.9700 834.9945 847.1622 853.5291 863.6717 898.0808 920.7785 933.7084 952.3240 961.0691 981.8256 983.0383 986.7984 990.0966 998.1987 1002.0615 1027.1235 1046.5355 1082.5015 1092.3390 1101.0527 1110.4455 1112.1806 1119.6309 1144.0648 1149.8772 1153.6555 1155.7455 1161.2904 1171.8568 1187.2973 1201.8438 1216.8078 1230.0844 1256.3044 1258.9452 1267.6703 1290.2055 1317.3659 1324.6393 1350.4425 1377.1795 1380.6130 1384.4716 1401.5800 1405.4881 1426.8810 1440.3121 1443.8847 1452.2205 1454.3803 1463.9721 1465.7151 1472.5800 1476.8845 1481.6129 1482.3906 1484.7909 1498.6035 1585.5163 1592.1463 1610.1724 1615.1024 2869.8819 2943.3729 2959.5958 2965.0291 2972.0183 2975.1153 2980.7517 3047.7181 3076.2460 3079.8000 3082.5225 3119.0179 3121.9239 3123.1689 3126.4946 3135.3557 3140.2189 3147.3063 3157.0809 3168.3191 3170.5084 3433.7684 3564.6603
redmass: 4.4119 4.8900 4.6235 3.8687 3.1366 2.6419 3.0138 3.4890 2.8703 2.2602 2.9397 2.0313 2.5229 1.2518 2.1551 3.4751 4.1651 2.7999 2.8388 1.8378 1.2589 3.2936 3.9382 4.1910 4.5149 3.0492 3.0899 4.2294 3.2757 3.7287 4.1119 5.8320 3.9467 3.8122 3.9263 6.3259 3.2024 1.7711 2.3548 2.8230 3.5946 3.1028 2.3941 2.7399 1.3933 1.5452 2.1837 1.2844 3.4188 1.7247 1.7135 1.5690 4.4701 1.6942 1.5433 4.9180 5.8971 1.3428 3.6100 2.2160 1.8907 1.6541 2.2108 1.9823 1.2588 1.2378 2.7300 1.6003 1.7107 1.3566 1.6835 1.8390 1.0562 1.1330 2.1209 1.3642 1.5233 1.4045 1.6735 2.8653 1.2449 1.3684 1.2889 1.6368 1.2885 5.6693 3.9083 2.0509 1.7539 1.1975 2.0442 1.3243 1.1866 1.0726 1.0593 1.0508 1.1197 1.0641 1.1064 1.0669 2.3548 2.4294 7.7206 6.0979 6.4885 6.0715 1.0696 1.0833 1.0327 1.0870 1.0347 1.0842 1.0365 1.1040 1.0999 1.0971 1.0994 1.0852 1.0994 1.1044 1.0881 1.0900 1.0935 1.0876 1.0978 1.0966 1.0974 1.0742 1.0660
irintensity: 0.4469 0.4692 0.0320 0.7385 3.1929 1.0527 0.3931 9.3587 4.5938 1.0346 2.9110 2.8624 0.5154 0.3864 3.7496 2.1297 6.3527 3.2877 11.4841 1.7350 105.3857 51.7154 4.6400 3.5851 0.3265 0.5541 0.2889 3.0537 2.8248 4.5646 10.3188 3.7145 12.8978 13.3760 12.7050 0.4416 35.9042 98.1384 5.6061 20.9103 7.2054 16.9786 61.4411 7.2352 52.4865 9.6331 17.9827 2.9194 3.2144 3.8599 8.4198 26.6380 31.9641 17.3267 9.9026 61.1291 4.4060 0.9163 57.7241 7.0841 1.1175 7.9923 13.6239 65.5341 0.2790 10.4201 28.3214 21.3765 147.5849 3.9435 25.2665 19.9901 0.7455 2.3805 48.0501 2.7711 4.4845 8.5586 57.2086 150.5993 3.7389 10.5768 1.7335 2.7139 25.3979 14.1290 28.6305 40.9538 6.6552 2.7816 7.9632 15.9650 76.8342 10.0263 11.9999 13.6877 84.3374 20.3125 31.7652 5.8485 11.0227 106.5461 14.1513 0.5932 15.7248 3.7130 75.3421 41.1165 60.6202 28.4302 98.0539 54.9846 14.1622 45.7051 38.2799 39.7741 30.2900 3.6185 25.2094 20.3414 3.3266 10.7634 33.9078 4.7252 27.2358 6.5297 9.1419 1.6565 8.2381
temp: 298.150 k
press: 1.00000 atm
elementType: 8 8 8 7 6 6 6 6 6 6 6 6 6 6 6 6 6 6 6 6 6 6 1 1 1 1 1 1 1 1 1 1 1 1 1 1 1 1 1 1 1 1 1 1 1
symmnumber: 1
zpe: 976205.2 jmol-1
zpe.correction: 0.371817 hartree
zpe.thermalcorrener: 0.394579 hartree
zpe.thermalcorrenthalpy: 0.395524 hartree
zpe.thermalcorrgfe: 0.317255 hartree
zpe.sumelectzpe: -978.434098 hartree
zpe.sumelectthermal: -978.411336 hartree
zpe.sumelectthermalent: -978.410392 hartree
zpe.sumelectthermalfe: -978.488661 hartree
dipole: -1.8697 -3.6523 1.1033
dipole: 4.2488
quadrupole: -131.0922 -123.8252 -123.0713
quadrupole: 7.5649 -1.4527 -0.0221
quadrupole: -5.0960 2.1710 2.9250 7.5649 -1.4527 -0.0221
hfenergy: -978.8059153 hartree
pointgroup: C01 [X(C18H23N1O3)]
dipole: -0.6629227 -0.4974339 1.4516835 debye
polarizability: 268.571963|-14.7554658|179.657254|11.3782824|-15.2300926|191.3898144 unknown
InChI: InChI=1S/C18H23NO3/c1-13(18(20)15-7-5-4-6-8-15)19-12-14-9-10-16(21-2)17(11-14)22-3/h4-11,13,18-20H,12H2,1-3H3
charge 0 multiplicity 1
45 atoms
O  4.35973 -2.476098 0.017599
O  -4.779787 1.0570 1.460447
O  -5.03394 0.882126 -1.373731
N  0.918946 -0.966507 0.388238
C  2.159326 -1.636855 0.84196
C  3.191224 -1.65072 -0.341564
C  -0.298057 -1.231062 1.185373
C  2.762682 -1.068782 2.149592
C  3.708135 -0.27059 -0.722928
C  -1.546887 -0.657994 0.520787
C  2.956068 0.545293 -1.607044
C  4.924824 0.227856 -0.193664
C  -2.567004 -0.079876 1.315956
C  -1.718695 -0.71204 -0.881634
C  -3.750889 0.429099 0.731731
C  3.401807 1.84433 -1.941069
C  5.374473 1.522972 -0.534794
C  -2.903154 -0.218851 -1.468756
C  -3.931572 0.345311 -0.683854
C  4.612722 2.338935 -1.403841
C  -4.584485 1.220374 2.902137
C  -6.385886 0.497402 -0.919678
H  1.884587 -2.701523 1.015383
H  2.65381 -2.091502 -1.207394
H  1.063591 0.041286 0.233842
H  -0.24156 -0.843841 2.232218
H  -0.394379 -2.33417 1.271002
H  3.705106 -1.587237 2.403089
H  2.985821 0.008006 2.03987
H  2.05932 -1.194174 2.993007
H  2.026865 0.157767 -2.042197
H  5.519439 -0.417743 0.459184
H  4.049444 -3.399762 0.195001
H  -2.420093 -0.016578 2.399945
H  -0.921596 -1.140668 -1.496379
H  2.810993 2.462982 -2.626099
H  6.321408 1.894365 -0.126153
H  -3.060831 -0.254956 -2.551511
H  4.963429 3.343202 -1.667605
H  -3.682727 1.82547 3.118089
H  -4.506393 0.24135 3.414265
H  -5.480609 1.752165 3.254825
H  -6.504218 -0.603544 -0.948592
H  -7.069631 0.964684 -1.645032
H  -6.583357 0.870098 0.098379
