program: Gaussian 09
title: 000029269
version: EM64L-G09RevD.01
frameworkgroup: C1[X(C9H19N3O4)]
method: RPBEPBE
basis: SDD
operation: Freq
keyword: #p
keyword: freq=noraman
keyword: PBEPBE/SDD
title: #p freq=noraman PBEPBE/SDD
converged: YES YES NO NO
title: Mulliken charges:
elementType: O O O O N N N C C C C C C C C C H H H H H H H H H H H H H H H H H H H
charge: -0.414684 -0.232714 -0.410659 -0.245625 -0.290237 -0.572316 -0.589952 -0.341928 -0.397821 -0.420724 -0.361346 -0.174487 -0.370281 -0.201495 0.134200 0.218322 0.234869 0.183136 0.182700 0.216872 0.207314 0.226474 0.183455 0.210514 0.247129 0.251241 0.185568 0.219379 0.241071 0.279249 0.280719 0.275295 0.294050 0.378006 0.374703
chargesum: 0.00000
title: Mulliken charges with hydrogens summed into heavy atoms:
elementType: O O O O N N N C C C C C C C C C
charge: -0.036678 -0.232714 -0.035956 -0.245625 -0.038997 -0.012347 -0.020607 0.076078 0.001751 0.013064 0.032624 0.072642 0.034666 0.039577 0.134200 0.218322
polarizability: 1.60969848e+02 7.30496429e+00 1.26594390e+02 7.50002008e+00 -1.90947640e+00 1.14123585e+02
1716.lowfreq: -1.2554 -0.0008 -0.0007 -0.0003 3.4762 9.3067 16.4816 22.0829 34.3122
frequency: 16.0791 21.1225 34.1632 39.6859 47.7788 60.2913 82.8665 99.5811 116.2722 133.7511 146.1476 157.8948 202.8434 218.1140 222.1989 233.6453 269.3363 284.9550 318.2314 329.1157 368.1515 421.5526 449.9730 487.8456 515.5756 564.7423 595.7503 600.3416 607.4192 616.2129 647.7049 690.5586 710.1174 715.0751 744.5084 770.9831 791.2960 850.5230 894.3017 947.1387 981.4104 997.0887 1018.4098 1032.5218 1041.5852 1056.3915 1065.3289 1071.6201 1091.9146 1110.3218 1131.9119 1141.8261 1152.9835 1186.5019 1206.0588 1219.5859 1227.5455 1250.3822 1264.5597 1270.4031 1282.6742 1289.4563 1302.2822 1304.4625 1321.9151 1333.6612 1354.1373 1363.6683 1377.4551 1406.6648 1458.5506 1459.4670 1467.2270 1475.7227 1482.6207 1495.7372 1612.7319 1651.5788 1654.8986 1675.4272 2838.5542 2852.9866 2954.6096 2966.4330 2976.7985 2993.8605 3006.2667 3020.5119 3029.2585 3035.2578 3040.7893 3060.2402 3437.5565 3443.8287 3470.8308 3498.2125 3503.3162 3566.1434 3608.8971
redmass: 5.3624 5.8969 7.0390 5.6901 5.5156 3.6452 2.3766 3.3056 3.7395 2.3784 2.6472 3.0497 3.2261 1.2831 1.5463 2.9144 2.9942 2.2169 3.3107 3.6886 3.4308 3.8727 3.7403 2.7992 2.4051 1.7936 1.5141 2.1279 2.3412 1.5299 1.3526 1.7282 3.5606 3.8134 1.0856 2.9926 1.2325 4.3060 1.5274 2.2749 1.6664 3.9598 2.4994 2.6209 2.3932 1.7773 2.5347 2.2767 2.8857 1.7914 1.2993 2.5393 4.1119 1.9702 1.4770 1.3197 1.4482 1.3679 1.5779 1.3414 1.0731 1.5187 1.2229 1.2774 1.2730 1.3292 1.5477 1.3895 1.5091 1.8174 1.1375 1.1538 1.0677 1.0865 1.0918 1.0884 1.2468 1.2326 4.5231 4.3005 1.0713 1.0709 1.0646 1.0635 1.0616 1.0844 1.0865 1.0938 1.0909 1.0876 1.0944 1.1021 1.0741 1.0454 1.0445 1.0641 1.0637 1.0964 1.0989
irintensity: 0.9765 0.8075 0.3029 0.7541 1.1538 2.1762 1.2997 1.4577 2.7803 1.3270 2.9098 2.9773 5.7793 30.5547 59.4200 4.9992 15.3478 29.0579 2.4692 0.9742 22.7048 13.1551 4.6014 53.7843 35.4165 160.6296 115.0440 66.9512 22.1545 241.6004 53.8397 226.3642 47.6958 50.1795 12.2967 5.5565 2.6158 15.8770 0.8241 6.4074 3.3110 25.3334 20.0534 242.6474 8.8209 89.5112 127.1679 12.5015 22.8283 3.0669 6.5659 13.2607 54.7932 10.0038 20.5025 7.6396 4.5691 8.5120 8.3738 0.6654 0.3730 26.9073 0.4696 4.0326 4.1214 7.7762 0.5199 5.0459 7.2225 19.2579 16.6565 19.7609 3.7262 10.3706 6.0162 6.9231 126.1491 5.7201 272.3338 139.9077 89.0632 150.7343 9.0254 6.4115 54.1572 36.1602 8.6764 11.3629 13.3346 40.2423 3.9549 85.6455 0.3061 1.1898 5.9338 12.2666 16.0401 3.6251 7.2945
temp: 298.150 k
press: 1.00000 atm
elementType: 8 8 8 8 7 7 7 6 6 6 6 6 6 6 6 6 1 1 1 1 1 1 1 1 1 1 1 1 1 1 1 1 1 1 1
symmnumber: 1
zpe: 763318.5 jmol-1
zpe.correction: 0.290733 hartree
zpe.thermalcorrener: 0.310383 hartree
zpe.thermalcorrenthalpy: 0.311327 hartree
zpe.thermalcorrgfe: 0.238760 hartree
zpe.sumelectzpe: -818.198046 hartree
zpe.sumelectthermal: -818.178396 hartree
zpe.sumelectthermalent: -818.177452 hartree
zpe.sumelectthermalfe: -818.250019 hartree
dipole: 1.9140 -1.5315 0.0214
dipole: 2.4514
quadrupole: -110.7967 -85.9645 -99.6080
quadrupole: 11.3286 -10.4879 2.7792
quadrupole: -12.0070 12.8252 -0.8183 11.3286 -10.4879 2.7792
hfenergy: -818.4887789 hartree
pointgroup: C01 [X(C9H19N3O4)]
dipole: -0.7676186 -0.5838803 -0.0015232 debye
polarizability: 160.6750344|-8.0983361|126.9888829|7.3143632|1.7149227|114.0239052 unknown
InChI: InChI=1S/C9H19N3O4/c10-6(8(13)14)3-1-2-4-12-5-7(11)9(15)16/h6-7,12-13,15H,1-5,10-11H2
charge 0 multiplicity 1
35 atoms
O  -5.444146 1.720942 0.975915
O  -6.140523 0.709801 -0.997667
O  4.26117 1.688981 -1.225664
O  4.897419 1.40976 0.990767
N  2.082679 -0.484281 -0.275577
N  -4.537372 -1.620769 -0.321192
N  5.830116 -1.164527 0.093686
C  -1.734211 -0.602809 0.353779
C  -0.378505 -0.112774 -0.200539
C  -2.915175 0.264016 -0.128753
C  0.806585 -0.964253 0.294844
C  -4.290782 -0.320706 0.314745
C  3.287105 -1.193018 0.185343
C  4.586332 -0.581634 -0.430111
C  -5.387483 0.713524 0.001577
C  4.604591 0.913171 -0.118965
H  -1.921194 -1.650183 0.050193
H  -1.703952 -0.590644 1.463463
H  -0.408225 -0.138879 -1.311221
H  -0.198236 0.941532 0.086171
H  -2.903432 0.334625 -1.236143
H  -2.817748 1.293476 0.265998
H  0.607882 -2.042013 0.062024
H  0.879208 -0.888629 1.398451
H  -4.264556 -0.456514 1.41156
H  2.041248 -0.404803 -1.301229
H  3.289706 -2.289517 -0.049692
H  3.352058 -1.094997 1.287064
H  4.559708 -0.702438 -1.528221
H  -4.702164 -1.537525 -1.331687
H  -5.27978 -2.167848 0.127223
H  5.938993 -2.167108 -0.074809
H  6.04267 -0.877575 1.054187
H  -6.134221 2.393439 0.722711
H  4.236835 2.648576 -0.958526
