program: Gaussian 09
title: 000029387
version: EM64L-G09RevD.01
frameworkgroup: C1[X(C13H13I3N2O5)]
method: RPBEPBE
basis: SDD
operation: Freq
keyword: #p
keyword: freq=noraman
keyword: PBEPBE/SDD
title: #p freq=noraman PBEPBE/SDD
converged: NO YES NO NO
title: Mulliken charges:
elementType: I I I O O O O O N N C C C C C C C C C C C C C H H H H H H H H H H H H H
charge: 0.119001 0.179972 0.135810 -0.415763 -0.404880 -0.225179 -0.232658 -0.219539 -0.080854 -0.493401 -0.553038 0.626340 -0.432948 -0.424371 -0.678544 -0.558652 0.745526 -0.103085 -0.534157 0.196621 0.192529 0.228594 -0.771463 0.218846 0.296050 0.307433 0.228191 0.300972 0.243837 0.278515 0.321865 0.381783 0.382581 0.258395 0.264428 0.221247
chargesum: 0.00000
title: Mulliken charges with hydrogens summed into heavy atoms:
elementType: I I I O O O O O N N C C C C C C C C C C C C C
charge: 0.119001 0.179972 0.135810 -0.033981 -0.022299 -0.225179 -0.232658 -0.219539 -0.080854 -0.171536 -0.038142 0.626340 0.102675 0.120437 -0.678544 -0.558652 0.745526 0.175430 -0.534157 0.196621 0.192529 0.228594 -0.027394
polarizability: 3.28848457e+02 -1.35441297e+01 2.72382823e+02 -1.55024011e+01 -7.33796288e+00 1.52107652e+02
1716.lowfreq: -6.7681 -6.5859 -0.0007 -0.0006 -0.0005 4.8913 14.5617 19.5206 23.5550
frequency: 14.5313 19.4874 23.4391 28.7322 36.4754 36.8883 46.1783 50.9341 52.9617 56.7040 67.8806 87.8041 91.0499 100.7357 114.0005 129.2966 147.0802 160.7619 189.6259 221.0817 229.9510 263.0933 275.1090 286.1943 309.1909 329.7149 338.2611 383.6390 407.0989 436.4979 483.6083 494.1765 497.4665 499.1875 514.4512 533.4801 549.9459 585.2710 588.8124 611.6244 622.0915 629.6126 643.2574 663.1347 703.3306 718.1900 800.6964 818.7019 867.7634 877.6098 892.5757 919.4795 948.7959 975.0720 979.4230 986.3519 1011.5152 1021.8695 1033.8747 1037.8097 1048.8435 1136.7613 1169.1704 1201.6492 1218.8579 1226.2684 1238.9677 1244.6297 1255.3412 1263.2939 1277.0074 1325.2454 1341.2979 1376.0540 1380.5697 1381.9070 1397.5894 1402.3280 1427.7358 1430.8299 1442.2992 1455.4637 1467.3039 1488.8202 1513.2046 1544.1674 1642.2909 1669.2415 1679.5985 2847.9560 2865.9211 2914.9910 2992.1001 3035.5011 3054.5047 3066.1113 3080.5309 3126.0933 3184.7959 3517.7510 3522.3392 3525.2943
redmass: 10.2762 8.9484 9.2125 7.5381 2.5193 5.6775 14.2875 2.7838 4.4770 4.0330 3.2988 32.3791 7.6252 25.6806 7.9818 6.2485 5.8654 104.5690 3.8123 4.5707 5.7686 4.4792 7.0255 5.0720 4.7280 3.7707 6.2963 4.0465 3.2180 4.3102 3.0471 1.4897 2.2264 2.0491 4.4058 4.7597 2.8175 4.5720 4.4130 3.9036 2.1389 1.5919 2.7863 6.2743 7.4454 7.2281 6.4732 4.8461 4.0805 1.3989 4.1301 3.9827 2.8949 2.3544 2.1751 1.8558 5.5714 3.3439 1.8211 2.2716 2.3751 2.7522 2.2162 2.0610 3.3955 1.6188 1.7142 1.5417 1.2643 1.7610 1.7599 5.1260 4.0184 1.4945 1.2386 1.5186 1.5664 2.8549 1.0879 1.6517 1.1206 1.2459 1.0614 1.0876 8.9428 8.4067 7.1682 8.2439 8.3937 1.0705 1.0705 1.0687 1.0377 1.0892 1.0846 1.0853 1.0983 1.0987 1.0933 1.0641 1.0642 1.0768
irintensity: 0.3899 0.8225 1.4547 0.9795 1.3437 1.5007 0.2428 0.2931 0.5290 0.0049 7.0721 0.0781 4.2687 1.1336 0.2351 1.1216 1.0928 0.1024 5.7382 5.0833 1.1337 3.5326 0.5894 3.1457 3.5295 4.4498 2.5466 5.8871 5.1207 12.7429 22.5063 84.0745 24.1766 23.1994 7.6833 3.3120 35.3753 5.8574 17.5423 62.5482 45.1445 142.2374 48.3483 19.7722 19.0015 48.4696 20.9823 7.1368 0.2287 12.1460 4.7386 12.7338 45.1400 63.4091 25.7264 9.4823 52.0217 148.9308 98.5213 261.5514 177.8472 33.9387 17.9683 16.3579 106.7116 27.9492 1.5323 33.6281 4.4642 18.3189 8.7341 30.3725 63.9716 27.9403 67.9105 11.2233 16.0445 88.3543 24.6247 247.6288 22.6134 65.6995 20.4220 13.0012 38.8121 63.1069 128.1917 193.0568 225.1714 76.8380 53.7127 45.6236 8.8523 11.8945 15.2859 7.3782 13.5808 7.5609 0.2093 29.5328 37.0510 23.4296
temp: 298.150 k
press: 1.00000 atm
elementType: 53 53 53 8 8 8 8 8 7 7 6 6 6 6 6 6 6 6 6 6 6 6 6 1 1 1 1 1 1 1 1 1 1 1 1 1
symmnumber: 1
zpe: 644932.0 jmol-1
zpe.correction: 0.245642 hartree
zpe.thermalcorrener: 0.271616 hartree
zpe.thermalcorrenthalpy: 0.272561 hartree
zpe.thermalcorrgfe: 0.180770 hartree
zpe.sumelectzpe: -1021.609548 hartree
zpe.sumelectthermal: -1021.583573 hartree
zpe.sumelectthermalent: -1021.582629 hartree
zpe.sumelectthermalfe: -1021.674419 hartree
dipole: -2.5216 1.7738 -2.2715
dipole: 3.8294
quadrupole: -154.9334 -172.3940 -175.9510
quadrupole: 2.7870 1.2927 -4.8590
quadrupole: 12.8261 -4.6345 -8.1915 2.7870 1.2927 -4.8590
hfenergy: -1021.8551894 hartree
pointgroup: C01 [X(C13H13I3N2O5)]
dipole: 1.1254302 -0.9807287 -0.2035873 debye
polarizability: 327.5204943|13.0216331|227.2923586|26.9059971|-56.1007534|198.5260791 unknown
InChI: InChI=1S/C13H13I3N2O5/c1-6(19)17-13-9(15)2-8(14)7(12(13)16)3-18(4-10(20)21)5-11(22)23/h2,17,20,22H,3-5H2,1H3
charge 0 multiplicity 1
36 atoms
I  1.406179 -2.669616 0.512358
I  -1.556353 1.810226 -2.714681
I  4.401032 2.209471 -1.723841
O  -5.45299 -1.887456 -0.560039
O  -1.488321 1.42441 3.297016
O  -4.049326 -0.825942 -2.072728
O  -3.434285 1.385501 2.033903
O  3.145667 -0.035364 2.140163
N  -2.118976 -0.386642 0.133261
N  3.774445 -0.542053 -0.051764
C  -1.215304 -1.015899 -0.878541
C  0.103822 -0.280058 -1.054574
C  -3.37215 -1.137579 0.318226
C  -1.482462 -0.051563 1.418221
C  1.333693 -0.769762 -0.520671
C  0.179292 0.928647 -1.808116
C  2.571779 -0.076138 -0.659712
C  1.395537 1.613986 -2.014952
C  2.573796 1.114878 -1.432964
C  -4.26302 -1.2288 -0.911549
C  -2.268644 0.978404 2.224484
C  4.011368 -0.467134 1.333511
C  5.375652 -0.991979 1.763347
H  -1.007638 -2.080562 -0.626603
H  -1.766676 -0.997048 -1.835408
H  -3.97388 -0.631477 1.092906
H  -3.203434 -2.188544 0.670719
H  -0.480908 0.374282 1.2414
H  -1.318177 -0.932575 2.089274
H  1.418343 2.529596 -2.608319
H  4.557395 -0.785946 -0.662952
H  -6.041982 -1.945334 -1.36036
H  -2.008569 2.08114 3.834839
H  5.295977 -2.071603 1.989738
H  5.681367 -0.473227 2.684459
H  6.15395 -0.855742 0.991649
