program: Gaussian 09
title: 000029347
version: EM64L-G09RevD.01
frameworkgroup: C1[X(C18H24ClNO2)]
method: RPBEPBE
basis: SDD
operation: Freq
keyword: #p
keyword: freq=noraman
keyword: PBEPBE/SDD
title: #p freq=noraman PBEPBE/SDD
converged: YES YES NO NO
title: Mulliken charges:
elementType: Cl O O N C C C C C C C C C C C C C C C C C C H H H H H H H H H H H H H H H H H H H H H H H H
charge: -0.054458 -0.280606 -0.438128 -0.152747 -0.158769 -0.161864 -0.014208 -0.077490 -0.533165 -0.488185 -0.491699 -0.527424 -0.779860 -0.411649 0.136324 -0.317661 0.266003 -0.359999 -0.362518 -0.239807 -0.213724 -0.095179 0.235878 0.229493 0.203323 0.207965 0.228061 0.218622 0.267925 0.214293 0.225349 0.208050 0.275962 0.216220 0.219200 0.222445 0.207958 0.228553 0.266053 0.201941 0.231859 0.304670 0.269289 0.355041 0.260222 0.258438
chargesum: 0.00000
title: Mulliken charges with hydrogens summed into heavy atoms:
elementType: Cl O O N C C C C C C C C C C C C C C C C C C
charge: -0.054458 -0.280606 -0.083087 -0.152747 0.077109 0.067630 0.189115 0.130474 -0.086481 -0.005967 -0.058300 -0.035241 -0.130256 0.082957 0.136324 0.116139 0.266003 -0.055328 -0.093229 0.020415 0.044714 -0.095179
polarizability: 2.94135098e+02 1.02457821e+01 2.05148815e+02 -1.21238446e+01 4.76684067e+00 1.43963869e+02
1716.lowfreq: -7.9590 -0.0021 -0.0019 -0.0008 3.4837 6.5036 21.2370 27.1505 46.3562
frequency: 18.4281 25.7539 46.2828 62.0821 72.4681 84.9699 95.1369 101.4188 108.9484 149.4829 172.3885 191.0667 216.8017 226.4813 255.0949 261.8520 279.9341 291.9411 312.9821 348.2494 363.2341 400.2709 402.1817 411.4210 422.5817 454.9796 462.5090 481.5808 503.8479 523.0531 564.4921 592.6767 620.4613 644.4907 689.2241 718.2544 727.2308 738.7607 745.9138 789.7317 805.2635 836.1946 839.6120 843.6398 853.3622 862.4889 885.6566 899.0887 926.2843 928.7457 935.9873 961.9272 966.9607 972.1025 993.4909 999.6174 1001.9463 1008.0388 1018.9058 1043.8053 1045.0361 1059.0469 1074.2877 1077.1611 1085.1935 1109.6227 1114.9656 1124.0120 1132.4051 1135.5898 1167.1877 1173.4025 1192.0920 1195.4627 1199.2773 1220.4241 1239.5907 1246.4027 1258.1945 1265.7028 1270.0443 1285.7289 1294.1119 1302.9971 1310.9473 1315.0821 1323.7375 1340.8128 1343.2266 1352.5154 1359.5330 1362.5827 1372.2577 1386.4553 1394.0155 1405.0277 1452.4856 1469.1006 1469.8264 1472.9300 1474.4973 1477.2382 1478.8929 1485.5725 1505.0623 1539.8156 1580.3942 1594.2418 2948.4779 2964.0352 2966.0472 2968.6879 2975.4733 2988.3686 2992.2072 3003.0466 3009.7040 3042.9294 3048.7025 3052.7674 3057.0446 3065.2186 3070.5087 3079.7346 3083.2252 3083.8720 3105.8091 3118.5278 3155.9297 3168.3480 3176.4470 3536.0024
redmass: 4.1492 6.1225 6.3195 3.7659 3.7508 7.1731 4.7674 3.6316 5.7938 4.2122 4.3580 3.8344 4.0673 1.0569 4.0281 3.3817 2.4049 3.5677 3.5282 2.2393 2.6366 1.9133 2.4161 2.4853 2.5718 3.3581 2.6020 4.5958 3.0101 2.6133 3.9526 3.1979 6.7429 3.8504 5.5332 4.9269 3.7377 3.4664 3.9347 2.6106 1.5487 2.0137 1.5059 2.0950 1.4385 2.6061 2.5156 2.3281 2.6343 2.0573 2.0790 1.7354 1.3849 1.6979 2.1842 2.5252 1.3974 1.5991 2.9464 1.5911 2.2169 2.0024 2.5850 1.4272 1.8757 1.7309 1.3956 1.5974 1.6331 1.6201 1.6300 2.2132 1.6015 1.1418 1.8546 1.3805 1.6530 1.5673 1.4286 1.3574 1.5425 1.3833 1.4694 1.2787 1.5080 1.5125 1.2051 1.4545 1.3885 1.3316 1.6086 3.7028 1.2512 1.2107 3.2502 2.2840 1.1308 1.1223 1.0701 1.0696 1.0954 1.0582 2.1349 1.0893 1.1030 6.4712 7.3772 5.9671 1.0819 1.0375 1.0704 1.0802 1.0702 1.0700 1.0598 1.0597 1.0663 1.0879 1.1017 1.0975 1.0925 1.0997 1.1045 1.0969 1.0979 1.0946 1.0932 1.0933 1.0887 1.0946 1.0974 1.0657
irintensity: 0.1457 0.2288 0.4288 0.8129 1.3078 5.4387 4.3481 6.2098 2.3489 0.7598 0.2347 2.3727 3.5186 0.0100 8.6253 7.5754 4.7363 7.1437 13.6913 15.3400 59.3098 115.5411 14.2129 0.6781 9.0339 17.2749 6.2427 31.1847 1.7788 11.6532 17.1981 1.4999 1.8322 3.6675 10.3583 18.2829 7.3403 5.0868 12.4017 1.0953 0.4458 7.9321 22.4742 2.1981 36.4136 11.5222 1.0488 9.6965 3.5413 2.3179 16.7749 0.3825 0.6186 10.1054 39.6477 26.8185 14.4586 3.0670 70.4261 6.1422 36.5031 20.6319 46.6931 12.9535 5.9799 10.0516 7.6870 3.5890 30.8704 2.8694 5.6054 1.3147 16.6642 1.8874 10.8567 0.8164 104.9449 20.4873 14.4232 7.8514 41.8119 3.9024 2.0731 0.0666 13.6452 3.3498 22.3906 11.4788 27.7010 2.7065 10.8264 0.5290 12.3992 16.2228 5.3478 149.5420 29.4843 9.4709 0.6619 8.1331 6.6293 4.4279 26.1848 27.0089 19.9005 153.7724 25.9645 59.2817 16.3741 45.3851 17.3557 23.1874 78.4961 72.8402 40.4948 38.9284 42.2019 83.9611 10.4680 31.4766 58.5219 44.6156 35.1845 26.5285 23.3762 16.8464 11.1873 18.3339 0.5830 2.8740 3.6229 3.9062
temp: 298.150 k
press: 1.00000 atm
elementType: 17 8 8 7 6 6 6 6 6 6 6 6 6 6 6 6 6 6 6 6 6 6 1 1 1 1 1 1 1 1 1 1 1 1 1 1 1 1 1 1 1 1 1 1 1 1
symmnumber: 1
zpe: 1012980.3 jmol-1
zpe.correction: 0.385824 hartree
zpe.thermalcorrener: 0.406906 hartree
zpe.thermalcorrenthalpy: 0.407850 hartree
zpe.thermalcorrgfe: 0.334333 hartree
zpe.sumelectzpe: -1363.899920 hartree
zpe.sumelectthermal: -1363.878838 hartree
zpe.sumelectthermalent: -1363.877894 hartree
zpe.sumelectthermalfe: -1363.951411 hartree
dipole: 3.5084 1.5726 2.3370
dipole: 4.4993
quadrupole: -147.9553 -139.2423 -142.4136
quadrupole: 3.0390 -0.4332 -1.5482
quadrupole: -4.7515 3.9614 0.7901 3.0390 -0.4332 -1.5482
hfenergy: -1364.2857439 hartree
pointgroup: C01 [X(C18H24Cl1N1O2)]
dipole: -1.3732247 -0.6640074 0.8982381 debye
polarizability: 293.1610684|12.7127211|205.8597447|14.1554508|-3.8350639|144.2269685 unknown
InChI: InChI=1S/C18H24ClNO2/c1-12-14-2-3-15(10-14)17(12)11-20(8-9-21)18(22)13-4-6-16(19)7-5-13/h4-7,12,14-15,17,21H,2-3,8-11H2,1H3
charge 0 multiplicity 1
46 atoms
Cl 6.695208 0.969942 0.718034
O  0.323219 1.109537 -1.55351
O  1.168713 -3.395592 -0.69717
N  -0.072331 -0.758943 -0.216565
C  -2.471445 1.135747 0.866643
C  -4.650797 0.882153 0.23336
C  -2.528475 -0.343412 0.365122
C  -4.012815 -0.490892 -0.165202
C  -3.874881 1.246041 1.535702
C  -2.618041 2.138628 -0.31738
C  -4.122101 1.969057 -0.749527
C  -1.488064 -0.790906 -0.684819
C  -4.744166 -1.714222 0.423955
C  0.286282 -1.670531 0.891158
C  0.764611 0.242592 -0.727209
C  0.287921 -3.154368 0.453515
C  2.212755 0.327271 -0.296713
C  3.104818 -0.777333 -0.251523
C  2.721244 1.632516 -0.061157
C  4.472133 -0.583151 0.04849
C  4.078522 1.837292 0.260164
C  4.934776 0.719321 0.311986
H  -1.605905 1.346684 1.517988
H  -5.750817 0.843963 0.313131
H  -2.433151 -0.997756 1.258451
H  -4.009345 -0.583177 -1.27115
H  -4.101372 2.263513 1.901892
H  -4.029046 0.527302 2.361683
H  -1.896832 1.943596 -1.127682
H  -2.424796 3.166012 0.042513
H  -4.682707 2.914258 -0.628401
H  -4.227703 1.653944 -1.804096
H  -1.53697 -0.14624 -1.577257
H  -1.732047 -1.825642 -1.00166
H  -4.85592 -1.622373 1.521033
H  -5.755831 -1.824493 -0.009222
H  -4.190401 -2.651893 0.222064
H  -0.43447 -1.548874 1.72416
H  1.277417 -1.39163 1.276125
H  -0.742697 -3.501454 0.231856
H  0.694661 -3.779003 1.265509
H  2.750492 -1.793302 -0.462325
H  2.043453 2.486887 -0.151598
H  0.838015 -2.851864 -1.45884
H  5.160477 -1.43276 0.070403
H  4.463711 2.842253 0.454268
