program: Gaussian 09
title: 000029252
version: EM64L-G09RevD.01
frameworkgroup: C1[X(C4H2Cl8)]
method: RPBEPBE
basis: SDD
operation: Freq
keyword: #pfreq=noraman
keyword: PBEPBE/SDD
title: #p freq=noraman PBEPBE/SDD
converged: YES YES NO NO
title: Mulliken charges:
elementType: Cl Cl Cl Cl Cl Cl Cl Cl C C C C H H
charge: 0.077977 0.077947 0.106180 0.153446 0.156306 0.153409 0.156365 0.106177 -0.230091 -0.229533 -0.604007 -0.604231 0.340067 0.339988
chargesum: 0.00000
title: Mulliken charges with hydrogens summed into heavy atoms:
elementType: Cl Cl Cl Cl Cl Cl Cl Cl C C C C
charge: 0.077977 0.077947 0.106180 0.153446 0.156306 0.153409 0.156365 0.106177 0.109975 0.110455 -0.604007 -0.604231
polarizability: 1.10483374e+02 1.49759027e-02 1.27507963e+02 1.21188415e+01 -5.71240735e-03 1.13338257e+02
1716.lowfreq: -2.1837 -0.0023 -0.0016 -0.0008 0.9939 10.0176 29.0429 48.3235 61.8839
frequency: 29.0372 48.3218 61.8776 122.9360 131.6321 148.0694 166.9271 174.4765 191.1229 191.2179 226.8322 235.0630 267.0334 269.5323 298.9094 302.4092 344.7504 365.8533 512.2189 531.3567 597.0820 636.7172 664.8753 708.4252 735.4450 770.5588 813.6306 990.8804 1022.4305 1070.6306 1178.6351 1233.9548 1296.3066 1332.7471 3067.9623 3069.2911
redmass: 30.0748 31.8757 26.7157 20.9838 32.8389 28.9106 31.8735 33.8103 33.2600 33.5125 22.1910 28.2377 27.7363 25.9657 25.1810 28.0302 24.3762 30.5764 10.8821 8.0388 7.0073 9.6061 11.0035 10.0266 8.6721 10.2822 5.3069 8.2041 10.1847 3.7257 1.1671 1.1738 1.1308 1.2603 1.0846 1.0838
irintensity: 0.0133 0.0474 0.0713 1.0559 0.1411 0.0024 1.3339 0.0106 0.0184 0.0220 0.8150 0.0523 0.4506 0.0002 1.5500 1.8750 6.6738 0.8797 65.5609 52.1438 4.9777 100.2754 14.6886 103.0968 215.7192 40.3061 44.7428 19.9749 58.2271 0.0385 2.8461 10.0575 24.4025 0.0634 1.2445 17.7281
temp: 298.150 k
press: 1.00000 atm
elementType: 17 17 17 17 17 17 17 17 6 6 6 6 1 1
symmnumber: 1
zpe: 142410.3 jmol-1
zpe.correction: 0.054241 hartree
zpe.thermalcorrener: 0.068854 hartree
zpe.thermalcorrenthalpy: 0.069798 hartree
zpe.thermalcorrgfe: 0.009980 hartree
zpe.sumelectzpe: -3833.131845 hartree
zpe.sumelectthermal: -3833.117233 hartree
zpe.sumelectthermalent: -3833.116288 hartree
zpe.sumelectthermalfe: -3833.176106 hartree
dipole: -0.0010 1.0548 -0.0011
dipole: 1.0548
quadrupole: -129.5236 -125.5351 -123.4772
quadrupole: -0.0001 0.7597 -0.0010
quadrupole: -3.3450 0.6436 2.7014 -0.0001 0.7597 -0.0010
hfenergy: -3833.1860863 hartree
pointgroup: C01 [X(C4H2Cl8)]
dipole: -0.00056 -0.0064034 -0.4149249 debye
dipolederiv: -0.1712009 -0.0085278 0.0177036 -0.0106966 -0.1848962 -0.1818818 -0.0020093 -0.207394 -0.2847786 -0.1713855 -0.0080929 -0.0180365 -0.0097419 -0.1721247 0.1781928 0.0017432 0.2036977 -0.2973544 -0.2531947 -0.0187618 -0.01161 -0.0549216 -0.2691288 -0.2472221 -0.087752 -0.2432867 -0.6291754 -0.4152538 -0.3012292 0.0527669 -0.2907415 -0.4823458 0.0546189 0.0507419 0.0717616 -0.1100971 -0.2139338 0.1450549 -0.1303877 0.140749 -0.3730407 0.256111 -0.1240305 0.2551948 -0.3350135 -0.415091 -0.3028872 -0.041675 -0.2921719 -0.4866747 -0.0413378 -0.0401564 -0.0585987 -0.1062036 -0.2132702 0.1483878 0.1256115 0.1438806 -0.3889478 -0.2548812 0.1193492 -0.254014 -0.3198808 -0.2526797 -0.0172496 0.0100445 -0.0510156 -0.2538746 0.2355249 0.0876217 0.2314928 -0.6448758 0.0351461 -0.0025672 -0.1320179 0.0814949 0.0843405 0.3082469 -0.1186004 0.3862619 0.2227504 0.0366931 -0.0001528 0.1330654 0.0839747 0.0615747 -0.3033083 0.116807 -0.3806062 0.2440779 0.9018988 0.1552448 0.0470489 0.1312072 1.1821052 -0.1136061 0.188338 -0.1519675 1.1161359 0.9004854 0.1538105 -0.0511032 0.1248403 1.1909253 0.1105039 -0.1915134 0.1486501 1.108873 0.11619 0.0287765 0.0209659 0.0027624 0.045689 -0.0049077 0.0742508 -0.0173744 0.0178688 0.1155962 0.0281942 -0.0223762 0.00038 0.0463986 0.0039466 -0.07479 0.0161826 0.0176731 unknown
polarizability: 109.1537901|11.8863097|114.6704751|-0.1403073|0.1809605|127.5053289 unknown
InChI: InChI=1S/C4H2Cl8/c5-1(3(7,8)9)2(6)4(10,11)12/h1-2H
charge 0 multiplicity 1
14 atoms
Cl 0.709058 1.477414 1.654131
Cl -0.699854 -1.417027 1.705536
Cl 1.788949 -0.81775 -2.059348
Cl 3.151446 1.404358 -0.557802
Cl 2.648533 -1.238603 0.815543
Cl -3.15214 -1.418558 -0.498618
Cl -2.646672 1.267067 0.787892
Cl -1.799503 0.755925 -2.075871
C  0.563972 0.53895 0.046018
C  -0.56301 -0.531929 0.066512
C  1.957782 -0.005081 -0.365003
C  -1.959274 -0.002449 -0.35568
H  0.3048 1.307664 -0.701928
H  -0.306986 -1.325082 -0.656582
