program: Gaussian 09
title: 000029298
version: EM64L-G09RevD.01
frameworkgroup: C1[X(C19H27N3)]
method: RPBEPBE
basis: SDD
operation: Freq
keyword: #pfreq=noraman
keyword: PBEPBE/SDD
title: #p freq=noraman PBEPBE/SDD
converged: YES YES NO NO
title: Mulliken charges:
elementType: N N N C C C C C C C C C C C C C C C C C C C H H H H H H H H H H H H H H H H H H H H H H H H H H H
charge: -0.409550 -0.054536 -0.096130 0.186111 -0.550828 -0.376891 -0.393751 -0.391430 -0.509557 -0.035014 0.234198 0.235217 -0.083849 -0.360382 -0.479725 -0.314085 -0.331957 -0.342148 -0.296144 -0.234413 -0.617138 -0.609705 0.214828 0.175522 0.198353 0.200343 0.187412 0.203546 0.213474 0.202677 0.239235 0.191604 0.266758 0.201672 0.276590 0.214453 0.198409 0.191349 0.217051 0.248179 0.259740 0.222285 0.225904 0.188507 0.227481 0.223158 0.224718 0.186903 0.231558
chargesum: 0.00000
title: Mulliken charges with hydrogens summed into heavy atoms:
elementType: N N N C C C C C C C C C C C C C C C C C C C
charge: -0.142793 -0.054536 -0.096130 0.186111 -0.160478 0.021805 -0.002793 0.024720 -0.078718 -0.035014 0.234198 0.235217 -0.083849 0.117879 -0.066863 -0.065907 0.076443 -0.082408 -0.073858 -0.008509 0.022008 0.033473
polarizability: 2.38108158e+02 1.88737315e+01 2.83236417e+02 -3.19764324e+01 2.03249651e+01 1.75703833e+02
1716.lowfreq: -10.9911 -9.5342 -5.3029 -0.0008 -0.0007 0.0002 17.6404 26.3915 37.7984
frequency: 16.3354 26.2790 37.6301 43.3421 66.8885 74.3840 91.3875 141.7562 167.0642 175.8581 193.5040 210.2121 220.7425 235.5090 245.4394 264.2828 306.5479 313.2349 322.2110 333.9955 356.2529 375.1476 386.4734 398.3624 413.0894 437.8315 453.9321 477.5572 493.9885 510.4483 515.3082 553.0872 557.1872 600.6262 634.6491 650.6411 679.7546 723.1547 737.5462 750.5067 769.0755 792.9757 822.0394 826.7970 834.6911 854.6524 869.3353 874.8543 884.3924 901.4021 948.9826 951.3636 956.3553 957.1509 987.6349 1003.1380 1025.8481 1035.6575 1037.2395 1046.8086 1067.2721 1077.6012 1080.7947 1089.9590 1095.1679 1106.3369 1119.2413 1133.0308 1138.3353 1155.3073 1172.1419 1187.1438 1204.0131 1205.8246 1211.4756 1240.3913 1250.6673 1265.2015 1268.8652 1269.8942 1282.2348 1298.4208 1310.5307 1323.1473 1326.3915 1338.0110 1346.0868 1351.4789 1355.6693 1357.8703 1370.2852 1384.9481 1395.9357 1418.3386 1430.0458 1439.8736 1442.4992 1449.7125 1456.3452 1458.2114 1460.5816 1462.8889 1464.4892 1467.2937 1472.9162 1476.2933 1477.9120 1480.8313 1486.0423 1496.6521 1503.7393 1552.5154 1571.6974 1618.8536 2843.0644 2847.7958 2865.2989 2950.2223 2954.7021 2964.7091 2967.0569 2972.3242 2972.7649 2975.0763 3011.4378 3017.5883 3017.9095 3019.2938 3025.1860 3027.4149 3036.6390 3037.7687 3065.2047 3068.0932 3076.9267 3083.0596 3126.4285 3143.9855 3163.8298 3176.8920 3533.1381
redmass: 3.9876 3.9372 2.6624 3.4396 3.7519 3.2783 3.7336 3.2657 2.8797 2.3605 2.8556 2.8869 1.4067 1.2017 2.4652 2.2415 2.8750 2.8425 3.3150 2.7692 2.5864 2.2935 2.8124 2.1925 2.0166 3.4426 3.0449 2.3894 1.8127 2.2291 2.3437 3.3914 3.4999 3.8656 4.7491 4.3758 5.0849 3.5386 2.4453 2.8494 1.3787 3.2031 3.0269 1.5928 2.2346 2.5818 2.0336 1.9215 2.5852 2.9949 1.9106 1.9005 2.2993 1.3790 1.3161 2.0954 2.3285 1.5260 2.0516 2.3627 1.9264 1.7893 1.7856 1.9877 1.8023 2.1023 2.0113 1.3591 1.4749 1.4083 1.6062 1.6014 1.3376 1.3949 1.3387 2.3117 1.2642 1.6509 1.7272 1.6052 1.6130 1.2515 1.4918 2.0960 1.6280 1.3892 1.4016 1.4149 1.4806 1.6896 1.3924 3.3058 2.9488 1.1440 3.0739 1.1627 2.5302 1.5463 1.0941 1.1678 1.1176 1.0688 1.1206 1.1111 1.1876 1.0766 1.0838 1.0938 1.0551 1.1916 3.3870 5.7831 4.1469 6.2419 1.0691 1.0570 1.0590 1.0673 1.0610 1.0616 1.0667 1.0632 1.0648 1.0624 1.0981 1.0891 1.0952 1.0734 1.1022 1.0726 1.1012 1.0948 1.0949 1.0938 1.1010 1.1004 1.0855 1.0905 1.0963 1.0957 1.0738
irintensity: 0.5756 0.0388 0.4550 0.2311 1.0027 0.8639 0.1476 0.1930 0.8867 2.9948 1.7337 0.9446 1.7609 0.2769 1.1619 0.3626 3.6429 8.8671 4.1393 1.7859 1.5365 2.2681 3.5379 2.7335 0.7590 8.1010 10.9211 0.5536 39.9345 19.1038 15.5271 5.1357 2.2565 14.0418 3.6609 21.8415 1.6826 3.4716 19.5080 6.8903 85.7116 0.3732 0.2915 6.3896 0.2716 2.7264 5.9234 4.3414 4.8942 3.6650 0.0276 5.7139 20.6472 2.2936 0.1567 25.6483 5.9446 7.9338 12.6757 7.2333 6.5668 9.6818 5.2106 4.7348 3.7743 12.1274 6.5137 3.7302 9.3021 2.2541 22.5032 3.9494 3.7857 36.6816 10.6197 0.6761 4.7231 2.5974 5.9442 6.3663 2.2693 2.8580 13.2548 11.5847 6.8319 0.2938 4.3666 19.1706 0.9358 3.0152 16.3449 56.0319 3.9539 3.5025 69.2430 8.6085 1.4397 47.2343 4.1300 8.7056 4.7874 6.3411 15.3897 9.1588 9.1672 10.3490 25.5868 38.1999 11.6825 24.8781 146.0965 29.9766 139.4798 11.8452 47.8586 79.4714 264.6354 57.8768 30.0824 39.7328 24.4429 11.6851 104.8053 33.5230 77.5826 1.9959 50.2667 41.5981 27.4244 34.0971 168.2678 21.7506 12.7968 16.8699 30.6598 40.4185 5.2715 17.1041 24.8268 23.1881 11.6552
temp: 298.150 k
press: 1.00000 atm
elementType: 7 7 7 6 6 6 6 6 6 6 6 6 6 6 6 6 6 6 6 6 6 6 1 1 1 1 1 1 1 1 1 1 1 1 1 1 1 1 1 1 1 1 1 1 1 1 1 1 1
symmnumber: 1
zpe: 1114822.5 jmol-1
zpe.correction: 0.424613 hartree
zpe.thermalcorrener: 0.445824 hartree
zpe.thermalcorrenthalpy: 0.446768 hartree
zpe.thermalcorrgfe: 0.373398 hartree
zpe.sumelectzpe: -902.804919 hartree
zpe.sumelectthermal: -902.783708 hartree
zpe.sumelectthermalent: -902.782764 hartree
zpe.sumelectthermalfe: -902.856134 hartree
dipole: 4.0811 -2.9568 -1.4048
dipole: 5.2318
quadrupole: -130.1922 -126.1901 -131.2116
quadrupole: 5.3550 -0.7864 2.3096
quadrupole: -0.9942 3.0079 -2.0137 5.3550 -0.7864 2.3096
hfenergy: -903.2295321 hartree
pointgroup: C01 [X(C19H27N3)]
dipole: 1.5141384 -1.2679104 -0.5801149 debye
polarizability: 241.221209|22.6928652|279.0991698|-29.8269589|24.9778541|176.7280297 unknown
InChI: InChI=1S/C19H27N3/c1-22(2)14-8-13-20-19-15-9-4-3-5-11-17(15)21-18-12-7-6-10-16(18)19/h6-7,10,12,20H,3-5,8-9,11,13-14H2,1-2H3
charge 0 multiplicity 1
49 atoms
N  1.006517 0.040112 -1.718562
N  -2.414026 1.007761 0.671633
N  3.310802 -1.085441 1.085769
C  -1.217253 -0.526676 -0.844643
C  -1.215305 -1.905368 -1.495196
C  -1.05646 -3.090534 -0.492729
C  -2.377982 -3.507147 0.195607
C  -3.063735 -2.408253 1.040885
C  -3.470695 -1.133726 0.246805
C  -2.324361 -0.163212 -0.002531
C  -0.13303 0.389282 -0.983253
C  -0.260271 1.704662 -0.372662
C  -1.406778 1.94122 0.478599
C  2.409297 0.410975 -1.427323
C  3.321606 -0.836872 -1.420018
C  0.635612 2.797309 -0.61644
C  3.059116 -1.760798 -0.208311
C  -1.550155 3.208137 1.131303
C  0.455511 4.035793 0.007576
C  -0.632555 4.237396 0.911052
C  4.745672 -0.91287 1.385943
C  2.580009 -1.705455 2.209763
H  -2.162781 -2.050616 -2.052757
H  -0.422895 -1.991739 -2.262566
H  -0.660873 -3.970154 -1.039832
H  -0.299763 -2.82233 0.271962
H  -3.088284 -3.844419 -0.589163
H  -2.184168 -4.388944 0.839362
H  -2.409259 -2.10985 1.883732
H  -3.977916 -2.842828 1.491703
H  -4.226381 -0.570797 0.820392
H  -3.94158 -1.441362 -0.710229
H  0.917158 -0.803157 -2.287197
H  2.792649 1.137055 -2.174348
H  2.462612 0.874948 -0.427837
H  4.375636 -0.498057 -1.423799
H  3.184576 -1.418108 -2.356491
H  3.66916 -2.694885 -0.316586
H  1.996565 -2.069439 -0.222997
H  1.452757 2.681841 -1.332219
H  -2.419891 3.334657 1.783648
H  1.14614 4.858995 -0.206796
H  -0.758448 5.206026 1.407811
H  5.288466 -1.885655 1.507032
H  4.860466 -0.337895 2.321928
H  5.243999 -0.343996 0.581989
H  2.730653 -1.105186 3.124919
H  2.90421 -2.754604 2.429899
H  1.497756 -1.717396 1.988373
