program: Gaussian 09
title: 000029415
version: EM64L-G09RevD.01
frameworkgroup: C1[X(C14H15I3N2O5)]
method: RPBEPBE
basis: SDD
operation: Freq
keyword: #p
keyword: freq=noraman
keyword: PBEPBE/SDD
title: #p freq=noraman PBEPBE/SDD
converged: YES YES NO NO
title: Mulliken charges:
elementType: I I I O O O O O N N C C C C C C C C C C C C C C H H H H H H H H H H H H H H H
charge: 0.171290 0.185147 0.162347 -0.286069 -0.391022 -0.214324 -0.209406 -0.207624 -0.328776 -0.329307 -0.055577 -0.385189 0.707532 0.549147 0.553457 -0.732919 -0.757737 -0.760346 -0.697418 0.183589 0.067541 0.063565 -0.594549 -0.594917 0.237368 0.249444 0.216633 0.243835 0.213790 0.223506 0.323875 0.323202 0.383780 0.230728 0.233673 0.278562 0.231542 0.278879 0.232749
chargesum: 0.00000
title: Mulliken charges with hydrogens summed into heavy atoms:
elementType: I I I O O O O O N N C C C C C C C C C C C C C C
charge: 0.171290 0.185147 0.162347 -0.286069 -0.007242 -0.214324 -0.209406 -0.207624 -0.004900 -0.006105 0.181791 0.080888 0.707532 0.549147 0.553457 -0.732919 -0.757737 -0.760346 -0.016288 0.183589 0.067541 0.063565 0.148414 0.148254
polarizability: 3.29770165e+02 -2.56927521e+00 3.15244592e+02 -1.01613196e+01 -3.99291894e+00 1.64758334e+02
1716.lowfreq: -7.2558 -0.0004 -0.0003 -0.0002 2.2899 3.9066 11.7907 22.9988 26.0084
frequency: 10.9254 22.9124 26.0025 30.6590 33.3118 36.7169 41.1976 48.4595 66.8120 73.3420 86.1808 89.0975 91.5375 99.8829 102.3715 110.8692 118.7887 133.3818 146.9391 161.5118 180.3447 190.9069 195.8864 208.7353 214.7453 231.3866 261.7109 265.7815 283.3600 297.5171 315.6775 382.9170 409.1297 411.1888 433.3311 460.1042 477.6379 527.9630 546.8227 563.6532 573.5807 581.9133 628.0603 659.9823 677.2788 685.2123 709.3461 711.7628 750.8219 752.7479 759.4386 773.2775 843.1568 864.9863 866.9171 938.8654 951.7355 1003.6865 1044.4916 1047.3311 1050.2150 1051.1433 1093.3400 1119.7514 1120.8608 1137.3753 1138.7653 1154.0278 1193.1607 1223.5258 1241.9721 1257.0614 1273.1220 1298.9676 1305.0478 1317.2949 1325.8545 1338.3187 1375.2288 1397.5055 1419.5997 1419.9128 1451.9902 1454.0946 1461.8573 1478.5627 1485.2653 1485.6067 1490.0766 1504.6491 1507.2516 1514.4425 1516.9756 1614.7311 1617.0572 1666.2507 2983.2358 2983.4982 2984.7576 3001.2664 3025.0703 3062.8243 3065.2264 3065.4269 3084.5559 3092.7944 3114.2313 3114.6380 3509.2611 3553.4780 3554.8364
redmass: 5.4520 8.3463 6.3505 3.9528 9.6192 5.3364 3.7314 5.6292 1.4033 5.7917 3.0582 6.9617 28.7590 3.1908 3.5185 1.4035 4.0853 6.6847 5.6026 83.1151 7.4313 3.8134 3.2919 2.5094 2.8692 6.7589 3.5629 4.5284 3.8029 4.3454 5.2070 7.0929 10.3256 9.5550 4.1826 8.4180 5.1180 4.7451 2.6687 1.3226 1.3190 3.6387 1.7497 10.1087 9.7238 7.6219 4.6938 6.3197 8.7010 2.2953 5.4254 4.1278 3.0230 2.5551 3.2593 2.7222 3.4925 10.6809 4.9261 4.6498 3.9014 2.1786 1.6636 1.2982 1.2981 1.6475 1.6455 2.2638 3.2040 2.4981 1.4415 1.4954 1.5036 3.3525 4.9130 3.7920 8.4761 1.6320 1.7926 1.2380 1.1810 1.1805 1.2881 1.2775 1.0790 1.0510 1.0452 1.0476 1.0499 5.1754 2.5733 2.0222 2.1360 7.9839 7.9925 9.0073 1.0347 1.0347 1.0364 1.0612 1.0847 1.0991 1.1026 1.1026 1.0992 1.1010 1.0987 1.0987 1.0640 1.0780 1.0780
irintensity: 0.2484 0.8929 0.6342 1.9571 2.2612 2.4625 5.0004 1.3103 0.0619 0.4338 1.3159 0.0812 0.3187 2.8928 0.9554 1.5453 1.7855 0.3347 5.1146 0.0711 1.8921 1.2028 0.0360 0.4484 1.9821 0.0326 2.5108 0.9617 4.4812 20.8817 9.6199 4.9859 12.2556 8.8108 9.4177 14.3539 18.6330 20.6855 57.7437 60.8707 50.1344 13.3898 78.3873 5.0438 29.6568 8.5352 100.1436 4.4096 0.9095 12.7839 9.4427 3.0629 29.6069 16.4727 16.8671 57.7855 13.9767 24.0015 10.6069 38.9293 146.8949 89.8805 42.9201 0.5541 0.7227 57.6284 64.3760 13.6597 11.6079 166.1452 25.9127 95.4974 3.3869 51.9520 7.7619 163.8247 4.7593 31.9763 39.8467 19.8810 13.9619 45.0004 104.5290 47.3499 8.7432 12.8707 12.8252 13.6312 13.8015 6.7899 1.1917 156.9876 148.5869 1.6354 355.2157 168.5260 77.0568 55.7675 33.6210 13.8259 32.9137 2.0005 21.0877 25.5083 29.4927 26.2438 1.4874 1.6122 33.1099 16.4722 27.0708
temp: 298.150 k
press: 1.00000 atm
elementType: 53 53 53 8 8 8 8 8 7 7 6 6 6 6 6 6 6 6 6 6 6 6 6 6 1 1 1 1 1 1 1 1 1 1 1 1 1 1 1
symmnumber: 1
zpe: 717222.6 jmol-1
zpe.correction: 0.273176 hartree
zpe.thermalcorrener: 0.301733 hartree
zpe.thermalcorrenthalpy: 0.302677 hartree
zpe.thermalcorrgfe: 0.205828 hartree
zpe.sumelectzpe: -1060.832340 hartree
zpe.sumelectthermal: -1060.803782 hartree
zpe.sumelectthermalent: -1060.802838 hartree
zpe.sumelectthermalfe: -1060.899687 hartree
dipole: 1.2254 1.2888 8.8696
dipole: 9.0461
quadrupole: -173.3443 -171.9913 -182.9649
quadrupole: 6.7117 -19.8077 1.4208
quadrupole: 2.7559 4.1088 -6.8647 6.7117 -19.8077 1.4208
hfenergy: -1061.1055156 hartree
pointgroup: C01 [X(C14H15I3N2O5)]
dipole: 0.7961523 -0.0460978 -3.4685275 debye
polarizability: 325.3393204|4.696871|317.086215|19.8030956|12.2765041|167.3475555 unknown
InChI: InChI=1S/C14H15I3N2O5/c1-4-5(14(22)23)24-11-9(16)6(12(20)18-2)8(15)7(10(11)17)13(21)19-3/h5,18-19,22H,4H2,1-3H3
charge 0 multiplicity 1
39 atoms
I  1.790219 -2.793587 0.51494
I  0.390624 3.157267 0.89234
I  -4.048628 -0.979754 -0.292684
O  2.072214 0.46838 0.809954
O  4.977713 0.644988 1.267381
O  4.435267 2.538602 0.035503
O  -3.244337 2.20062 1.487541
O  -1.786606 -3.691799 0.981843
N  -2.913902 2.602944 -0.790183
N  -1.44002 -3.499531 -1.320763
C  3.134776 0.440596 -0.264832
C  2.648447 0.932952 -1.632485
C  0.754847 0.123885 0.498892
C  -1.606411 0.846286 0.290993
C  -1.021916 -1.551961 0.087438
C  0.337088 -1.222353 0.318329
C  -0.237729 1.144287 0.50113
C  -1.975413 -0.503656 0.063044
C  3.734504 0.758081 -2.718249
C  4.222447 1.344863 0.329881
C  -2.66241 1.941942 0.394898
C  -1.454416 -3.009944 -0.029859
C  -3.892674 3.692036 -0.88884
C  -1.827033 -4.878418 -1.641739
H  3.522881 -0.592855 -0.327249
H  2.356965 1.995226 -1.554854
H  1.749882 0.351486 -1.914231
H  4.616671 1.386932 -2.505333
H  4.065637 -0.294661 -2.795614
H  3.34118 1.060147 -3.70475
H  -2.388969 2.32803 -1.622028
H  -1.164448 -2.869972 -2.076423
H  5.638353 1.256467 1.694074
H  -4.67672 3.453707 -1.630379
H  -3.403367 4.642969 -1.168999
H  -4.360166 3.810252 0.101423
H  -0.99194 -5.424836 -2.116851
H  -2.090124 -5.378878 -0.696453
H  -2.704486 -4.898943 -2.313706
