program: Gaussian 09
title: 000029290
version: EM64L-G09RevD.01
frameworkgroup: C1[X(C20H27ClN2S)]
method: RPBEPBE
basis: SDD
operation: Freq
keyword: #p
keyword: freq=noraman
keyword: PBEPBE/SDD
title: #p freq=noraman PBEPBE/SDD
converged: YES YES NO NO
title: Mulliken charges:
elementType: Cl S N N C C C C C C C C C C C C C C C C C C C C H H H H H H H H H H H H H H H H H H H H H H H H H H H
charge: -0.066313 0.161724 -0.024095 -0.101295 -0.384790 -0.558344 -0.390027 0.388951 -0.394605 -0.503418 -0.036715 -0.453687 0.442105 -0.119273 -0.674181 -0.322463 -0.291215 -0.305706 -0.331116 -0.335818 -0.159413 -0.233552 -0.669109 -0.669222 0.208906 0.213602 0.201903 0.237572 0.187491 0.206946 0.214823 0.208143 0.240810 0.199711 0.287331 0.280017 0.212086 0.219116 0.277140 0.208203 0.192626 0.219381 0.197229 0.269965 0.259607 0.228033 0.208425 0.208452 0.225927 0.206090 0.212041
chargesum: 0.00000
title: Mulliken charges with hydrogens summed into heavy atoms:
elementType: Cl S N N C C C C C C C C C C C C C C C C C C C C
charge: -0.066313 0.161724 -0.024095 -0.101295 0.037719 -0.118870 0.004410 0.388951 0.028361 -0.062897 -0.036715 -0.453687 0.442105 -0.119273 -0.106833 0.108739 -0.014075 -0.035741 0.069713 0.080792 -0.159413 0.026055 -0.024198 -0.025164
polarizability: 3.57758490e+02 -3.05543459e+01 2.95466412e+02 2.52571910e+01 1.19974483e+01 1.74406530e+02
1716.lowfreq: -6.7205 -5.2183 0.0022 0.0023 0.0026 4.3043 17.3985 18.4959 24.8959
frequency: 17.3389 18.1855 24.8731 41.2490 53.0505 57.4493 67.5799 82.9275 92.2490 120.5955 136.4563 140.1754 161.7421 178.4570 201.0804 205.6630 214.0619 238.5385 249.6785 262.7113 286.9322 289.6047 313.0456 318.3620 345.2846 355.7141 373.1218 390.2441 402.2649 410.6139 444.4008 451.9032 463.7957 476.3423 496.7734 525.7969 558.5549 573.4524 619.6430 643.4183 658.6764 681.2590 724.7903 742.3331 748.5014 763.2769 787.4332 793.0555 794.6921 798.2340 830.3333 834.8345 849.3601 869.0626 883.0312 894.6778 910.5013 938.8200 953.7365 959.5476 968.0730 984.6084 997.0310 1039.6481 1045.7123 1063.1198 1068.7631 1074.5865 1076.0909 1084.9403 1094.5832 1099.5673 1112.6289 1125.6964 1136.3495 1138.0659 1196.5826 1204.8854 1207.0005 1219.6769 1231.1132 1239.0137 1245.1803 1257.0953 1263.6219 1274.8573 1280.4102 1290.9937 1295.8232 1315.0371 1321.2441 1338.7310 1339.4166 1353.8922 1359.2038 1360.9480 1365.7244 1373.0707 1375.6140 1386.7953 1388.1397 1400.7001 1420.8261 1448.6603 1452.2314 1460.2147 1461.4821 1463.4227 1463.5733 1464.4429 1469.9435 1470.1395 1476.1628 1478.4618 1483.3997 1485.7052 1490.1739 1538.9238 1553.3300 1604.9051 2862.1230 2872.0338 2895.8842 2957.0313 2969.7183 2971.7481 2976.8683 2977.9310 2982.4542 2982.8916 3017.2133 3025.9133 3032.6911 3034.8653 3039.2541 3041.4647 3045.6451 3059.2833 3069.1877 3074.1714 3076.2704 3091.8885 3092.4860 3124.0418 3157.4507 3159.9342 3178.7783
redmass: 3.5937 4.6274 4.2896 6.2041 3.1715 3.4764 2.7601 2.1841 3.0592 3.8495 3.6077 4.8017 2.1316 2.1143 1.4960 4.1372 2.4323 3.1391 2.1082 2.9765 2.2305 3.5774 3.8770 3.0952 2.6805 4.2920 3.6813 3.6616 4.6480 4.7164 2.7875 2.7338 3.9282 2.7234 2.2201 3.4039 4.0221 3.9570 5.6389 6.3736 5.9067 6.1673 3.4855 2.0928 3.3188 1.3517 2.9688 2.4720 1.2264 1.2719 1.5399 1.8129 3.4008 2.2896 2.8556 1.4828 1.9032 4.6854 1.9284 2.1924 1.3376 2.2503 1.3950 2.2069 3.3077 2.1262 1.8713 2.7371 1.8998 2.1366 1.6540 2.2112 1.7904 1.5795 1.4316 1.4977 1.5130 1.4850 1.9317 1.5438 1.9057 1.6864 1.6513 1.4298 1.7427 1.3941 1.1130 1.2272 1.2586 1.3845 1.4820 1.6206 1.9045 1.4594 1.3462 2.7432 1.3300 1.7122 1.7609 1.2355 1.2336 6.3656 5.1175 1.0894 1.1547 1.0857 1.0632 1.8264 1.3729 1.0626 1.0700 1.0947 1.1151 1.0531 1.0719 1.0704 1.0767 8.1159 9.3475 7.4921 1.0719 1.0712 1.0702 1.0618 1.0666 1.0660 1.0636 1.0602 1.0358 1.0359 1.0957 1.0880 1.1027 1.0879 1.0885 1.1025 1.0583 1.0943 1.0943 1.0987 1.0982 1.1004 1.1003 1.1086 1.0883 1.0911 1.0981
irintensity: 0.1317 0.3480 0.0682 0.1889 0.2735 0.3692 0.2514 0.2717 0.0314 1.2411 0.0387 0.7278 1.6990 0.4942 0.4107 0.1599 1.8499 1.6125 1.8860 1.5304 1.5730 1.8654 0.0755 2.7610 0.0985 5.3830 1.1161 6.8116 2.6747 0.8355 4.1839 7.0021 0.7289 4.3310 0.6074 2.6371 7.0950 3.4917 14.6477 16.3989 34.9151 12.7486 0.2759 11.9549 10.7241 14.9030 3.7783 6.1723 3.6181 5.6757 6.8460 46.0267 3.2708 11.6650 24.7513 16.6560 2.2908 45.5803 5.3068 27.9038 0.8934 6.6791 0.1002 1.6714 1.1178 28.6657 4.2196 19.0451 31.5431 2.4675 51.6605 0.4623 0.3921 0.6149 3.1095 10.6466 29.3302 40.2544 20.5934 6.2245 10.3044 31.2116 18.9815 3.7432 0.1137 10.0157 1.5149 22.6521 16.0704 2.9132 1.0337 9.3052 18.6707 1.1792 5.6339 6.2510 1.7606 17.0384 6.4059 24.9377 22.1017 19.3486 10.6166 8.5218 16.6336 3.7366 5.6559 64.3999 19.0365 13.7038 10.9253 7.8493 18.0902 2.3749 19.5485 11.0979 8.9426 17.1642 21.5685 24.1982 67.5082 105.9614 88.6859 37.7345 20.0744 25.4665 31.6263 34.7060 33.1003 28.6712 85.4645 14.4755 18.7491 16.3571 21.8164 96.4756 11.9980 13.1271 17.6479 26.8752 94.3828 27.0860 50.3320 11.3321 0.4091 2.4742 6.8765
temp: 298.150 k
press: 1.00000 atm
elementType: 17 16 7 7 6 6 6 6 6 6 6 6 6 6 6 6 6 6 6 6 6 6 6 6 1 1 1 1 1 1 1 1 1 1 1 1 1 1 1 1 1 1 1 1 1 1 1 1 1 1 1
symmnumber: 1
zpe: 1119518.9 jmol-1
zpe.correction: 0.426402 hartree
zpe.thermalcorrener: 0.451230 hartree
zpe.thermalcorrenthalpy: 0.452175 hartree
zpe.thermalcorrgfe: 0.369113 hartree
zpe.sumelectzpe: -1744.137755 hartree
zpe.sumelectthermal: -1744.112927 hartree
zpe.sumelectthermalent: -1744.111983 hartree
zpe.sumelectthermalfe: -1744.195045 hartree
dipole: -0.2299 -2.1863 0.6202
dipole: 2.2841
quadrupole: -144.8834 -156.7873 -163.9930
quadrupole: -1.2116 0.1939 2.1382
quadrupole: 10.3378 -1.5661 -8.7717 -1.2116 0.1939 2.1382
hfenergy: -1744.5641573 hartree
pointgroup: C01 [X(C20H27Cl1N2S1)]
dipole: -0.3818882 0.8044862 -0.1204813 debye
polarizability: 329.0691509|47.6586153|318.6557245|-27.9329628|20.5244579|179.9065569 unknown
InChI: InChI=1S/C20H27ClN2S/c1-3-23(4-2)12-13-24-20-16-8-6-5-7-9-18(16)22-19-11-10-15(21)14-17(19)20/h10-11,14H,3-9,12-13H2,1-2H3
charge 0 multiplicity 1
51 atoms
Cl -1.227364 -4.252382 0.60794
S  -0.806645 1.319551 1.321185
N  2.917743 -0.233119 -1.109363
N  -4.527236 0.04788 -0.115648
C  2.70737 3.56553 1.28146
C  1.62526 3.09542 0.262336
C  4.103273 3.803941 0.660861
C  1.667264 1.608872 -0.039969
C  4.759608 2.56538 0.008593
C  3.962026 1.95857 -1.1837
C  2.80516 1.066164 -0.76677
C  0.652897 0.716988 0.356478
C  0.768422 -0.690894 0.050838
C  1.91961 -1.111721 -0.719476
C  -2.238375 0.957244 0.090505
C  -3.455981 0.393199 0.846454
C  -0.181156 -1.6776 0.467669
C  2.056838 -2.48784 -1.08745
C  -5.896236 0.390464 0.350612
C  -4.400473 -1.335064 -0.652854
C  -0.001174 -3.002204 0.082093
C  1.105022 -3.434817 -0.702626
C  -6.181121 1.904155 0.311131
C  -5.009193 -1.495757 -2.058529
H  2.361048 4.514615 1.735537
H  2.777068 2.829164 2.106243
H  1.758132 3.670111 -0.677331
H  0.625488 3.344224 0.656655
H  4.01714 4.603148 -0.105459
H  4.781656 4.196783 1.444806
H  4.930161 1.778164 0.769557
H  5.759614 2.859457 -0.366238
H  4.631029 1.331792 -1.797313
H  3.599407 2.786472 -1.827819
H  -2.492961 1.900972 -0.415653
H  -1.853755 0.240086 -0.652195
H  -3.144774 -0.481589 1.466023
H  -3.830008 1.156716 1.552672
H  -1.018558 -1.383632 1.106739
H  -6.613991 -0.118695 -0.317562
H  -6.087419 -0.004659 1.380102
H  -3.323153 -1.579649 -0.70654
H  -4.854444 -2.081581 0.04577
H  2.935394 -2.769174 -1.675352
H  1.203462 -4.487198 -0.982834
H  -6.055728 2.286776 -0.716595
H  -5.498271 2.470189 0.9711
H  -7.214936 2.111687 0.645091
H  -4.526221 -0.798063 -2.76456
H  -6.094988 -1.289922 -2.065688
H  -4.862727 -2.529255 -2.423622
