program: Gaussian 09
title: 000029262
version: EM64L-G09RevD.01
frameworkgroup: C1[X(C20H22ClNO)]
method: RPBEPBE
basis: SDD
operation: Freq
keyword: #p
keyword: freq=noraman
keyword: PBEPBE/SDD
title: #p freq=noraman PBEPBE/SDD
converged: YES YES NO NO
title: Mulliken charges:
elementType: Cl O N C C C C C C C C C C C C C C C C C C C C H H H H H H H H H H H H H H H H H H H H H H
charge: -0.045828 -0.295135 -0.086392 0.030467 -0.585850 -0.476762 -0.441848 0.455553 0.266359 0.374341 0.392459 -0.368075 -0.382136 -0.484093 -0.472047 -0.279236 -0.251041 -0.256450 -0.231819 -0.233919 -0.395826 -0.613608 -0.614520 0.242147 0.245377 0.241763 0.230788 0.234505 0.257654 0.246049 0.242336 0.224086 0.201465 0.252626 0.226148 0.230721 0.225221 0.190383 0.231251 0.188754 0.219732 0.230452 0.222088 0.223755 0.188106
chargesum: 0.00000
title: Mulliken charges with hydrogens summed into heavy atoms:
elementType: Cl O N C C C C C C C C C C C C C C C C C C C C
charge: -0.045828 -0.295135 -0.086392 0.030467 -0.343703 0.010378 0.023445 0.455553 0.266359 0.374341 0.392459 -0.368075 -0.124483 -0.238044 -0.229711 0.146315 0.001584 -0.030302 -0.001099 -0.008698 0.025807 0.025331 0.019428
polarizability: 2.67635168e+02 4.50140241e+00 2.46431383e+02 1.46149903e+01 -1.99584312e+00 1.64130120e+02
1716.lowfreq: -12.0483 -4.5695 -0.0014 -0.0007 0.0018 6.5032 14.8273 21.4360 42.3295
frequency: 14.1455 21.1151 42.3226 56.4640 69.8644 92.2927 119.6728 143.3150 154.5199 175.7217 185.0736 197.7759 205.3634 214.9495 219.8685 240.8337 246.2942 323.6921 338.4724 354.2792 360.7426 374.4490 382.1519 422.3916 440.8995 444.4909 471.3323 477.7289 492.5517 518.3472 573.7028 577.7285 596.1999 610.3383 649.6688 697.4425 716.8063 740.3151 765.0591 776.4435 787.5920 813.1502 816.5449 824.7900 826.1402 866.0529 880.2246 886.0093 902.7592 907.3849 949.8995 956.5093 969.1120 986.7794 993.9306 1023.0325 1026.7882 1029.0068 1033.1073 1040.1779 1050.3545 1071.9053 1076.0055 1086.9607 1093.4139 1106.9730 1136.7862 1140.4918 1142.7800 1157.0329 1167.1250 1171.2868 1178.1701 1192.4124 1196.1277 1209.1169 1221.9529 1239.8987 1250.9868 1261.8208 1267.0124 1288.7918 1301.1404 1305.3456 1321.3013 1330.0231 1377.0886 1386.2679 1392.2227 1418.4682 1424.6710 1437.8564 1441.3770 1445.4979 1460.1770 1460.7564 1464.7310 1465.6888 1474.3588 1475.7073 1481.7892 1485.1097 1494.7274 1570.0395 1596.0520 1606.3139 1616.9862 2845.3077 2854.2558 2872.3076 2960.6230 3003.6100 3017.9213 3019.3440 3024.4948 3027.3231 3052.2477 3055.9397 3060.8801 3079.1071 3083.2490 3085.6146 3119.8633 3130.5361 3131.2900 3147.0773 3150.2952 3161.6482 3171.7522
redmass: 2.9171 3.6439 7.5203 4.8261 4.8226 2.7333 2.6052 4.3493 3.6921 2.4404 2.3994 4.0271 2.5140 1.1870 2.5933 2.1144 3.1890 3.7717 4.0802 2.6947 5.2963 4.1015 4.4511 2.6609 3.9126 4.7108 4.4548 4.9247 4.2007 4.4184 4.4321 5.2890 4.3665 4.8747 5.4950 5.2999 5.3617 3.0732 1.2800 1.6915 1.9881 3.2744 1.5269 3.3104 2.3379 3.6995 2.1556 1.5271 1.8496 2.0044 1.4989 5.2780 1.3408 1.3665 4.2737 2.4633 2.6659 2.4686 1.5276 3.4954 3.0120 1.8472 2.3458 1.8203 1.7105 2.0555 1.4958 1.4684 1.6825 1.6764 1.5230 1.0951 1.4305 2.1518 1.4298 1.7409 1.5628 1.7967 1.5452 1.6784 2.5668 1.2127 1.4729 1.7409 1.4382 1.3962 5.4876 1.4637 6.4969 1.1433 2.6738 2.5449 1.1662 2.4339 1.0766 1.0879 1.6639 1.1615 1.0584 1.0777 1.2724 1.0546 1.0832 6.8173 7.0449 7.5862 7.1635 1.0576 1.0618 1.0654 1.0576 1.0584 1.0643 1.0726 1.0796 1.0886 1.0875 1.0935 1.1048 1.1007 1.1007 1.1054 1.0862 1.0874 1.0893 1.0937 1.0925 1.0998 1.0982
irintensity: 0.2619 0.7106 0.1675 1.2541 0.6541 0.1332 1.8227 0.9268 2.8178 0.2043 0.4461 0.2129 0.8756 1.6731 0.1208 2.3885 1.5027 8.1567 2.1319 5.4153 2.6694 1.8953 2.5460 0.8435 1.5729 3.8363 2.2256 1.8841 7.3566 0.1770 5.7587 2.1017 9.9443 2.7308 17.2447 11.8326 3.1597 9.0303 70.2920 38.0073 16.5737 6.8234 5.7076 6.4085 8.6971 14.6181 6.4686 0.0674 1.6743 0.2225 5.3171 30.9879 0.7001 0.8010 8.9525 9.7687 0.9826 17.0912 18.3979 8.4253 93.9752 41.0250 11.4224 19.3016 7.5369 2.6702 13.3365 15.3616 16.1751 40.8854 4.9960 1.3233 3.3801 19.1157 3.6920 13.8470 4.3027 7.4077 0.9272 1.2524 13.0752 8.0415 39.0328 3.6592 1.9795 0.3282 7.6839 0.9532 1.4418 2.5382 20.0202 38.1096 4.2131 0.8314 12.2475 12.1346 5.1441 8.4259 24.5400 10.7161 11.7360 12.1429 5.0270 31.7495 2.8058 6.7917 0.3899 67.1846 108.5389 166.4300 32.4602 29.3873 28.8366 32.8997 81.5335 20.1459 33.7257 27.5942 2.3593 26.4764 65.0501 42.9010 2.6499 4.2284 10.6645 23.9645 16.6142 31.3682 15.2220
temp: 298.150 k
press: 1.00000 atm
elementType: 17 8 7 6 6 6 6 6 6 6 6 6 6 6 6 6 6 6 6 6 6 6 6 1 1 1 1 1 1 1 1 1 1 1 1 1 1 1 1 1 1 1 1 1 1
symmnumber: 1
zpe: 969092.5 jmol-1
zpe.correction: 0.369108 hartree
zpe.thermalcorrener: 0.390114 hartree
zpe.thermalcorrenthalpy: 0.391058 hartree
zpe.thermalcorrgfe: 0.317779 hartree
zpe.sumelectzpe: -1363.656070 hartree
zpe.sumelectthermal: -1363.635064 hartree
zpe.sumelectthermalent: -1363.634120 hartree
zpe.sumelectthermalfe: -1363.707400 hartree
dipole: 0.6852 2.2980 1.1978
dipole: 2.6805
quadrupole: -122.7325 -139.9895 -143.6724
quadrupole: -0.9892 6.0366 -0.6081
quadrupole: 12.7323 -4.5247 -8.2076 -0.9892 6.0366 -0.6081
hfenergy: -1364.0251782 hartree
pointgroup: C01 [X(C20H22Cl1N1O1)]
dipole: 0.1768472 0.8988432 0.5224592 debye
polarizability: 266.0966451|5.5088208|247.2666437|16.7780572|3.8361339|164.833383 unknown
InChI: InChI=1S/C20H22ClNO/c1-22(2)12-13-23-20-11-10-14(15-6-3-4-8-17(15)20)16-7-5-9-18(21)19(16)20/h3-9,14H,10-13H2,1-2H3
charge 0 multiplicity 1
45 atoms
Cl 0.185914 -3.268206 -1.073458
O  -1.089665 -0.877553 0.012689
N  -4.814255 -0.89095 0.297262
C  0.092095 -0.152279 0.445806
C  2.276976 1.151835 1.106666
C  0.171152 0.031979 2.015598
C  1.463851 0.811686 2.409313
C  1.376893 -0.911746 0.052341
C  0.192957 1.249253 -0.182435
C  2.554064 -0.181729 0.416596
C  1.36019 1.960291 0.198567
C  1.555496 -2.170195 -0.558762
C  -0.730824 1.821427 -1.076846
C  3.843387 -0.685947 0.171803
C  1.590346 3.261778 -0.286627
C  -2.370663 -0.507141 0.642823
C  2.849011 -2.684337 -0.819923
C  -0.4987 3.129407 -1.568765
C  3.991557 -1.943857 -0.456741
C  0.650716 3.850678 -1.168951
C  -3.459893 -1.103383 -0.262819
C  -5.793012 -1.883586 -0.190926
C  -5.30586 0.491321 0.122709
H  3.210247 1.686875 1.350938
H  0.149602 -0.971618 2.476063
H  -0.724107 0.581022 2.353497
H  1.212341 1.750216 2.934298
H  2.096323 0.206128 3.082381
H  -1.599123 1.244466 -1.410987
H  4.723298 -0.101809 0.462973
H  2.494294 3.809127 0.005811
H  -2.4526 -0.948417 1.6546
H  -2.465451 0.59486 0.725494
H  2.946898 -3.659646 -1.305592
H  -1.208496 3.581375 -2.270793
H  4.987181 -2.349278 -0.665518
H  0.823113 4.86144 -1.5556
H  -3.349582 -0.683809 -1.294816
H  -3.271595 -2.189138 -0.338354
H  -5.986199 -1.81606 -1.292052
H  -6.756817 -1.740391 0.33068
H  -5.432921 -2.903317 0.031528
H  -4.602955 1.21207 0.574712
H  -6.278135 0.605735 0.634473
H  -5.445051 0.77342 -0.953055
