program: Gaussian 09
title: 000029256
version: EM64L-G09RevD.01
frameworkgroup: C1[X(C20H22ClNO)]
method: RPBEPBE
basis: SDD
operation: Freq
keyword: #p
keyword: freq=noraman
keyword: PBEPBE/SDD
title: #p freq=noraman PBEPBE/SDD
converged: YES YES NO NO
title: Mulliken charges:
elementType: Cl O N C C C C C C C C C C C C C C C C C C C C H H H H H H H H H H H H H H H H H H H H H H
charge: -0.078082 -0.316281 -0.085921 -0.009322 -0.558574 -0.476614 -0.435291 0.302139 0.278674 0.484170 0.397361 -0.443334 -0.388098 -0.373131 -0.470503 -0.279893 -0.222295 -0.255565 -0.266016 -0.234651 -0.390585 -0.613274 -0.614519 0.266173 0.242857 0.237854 0.231642 0.237709 0.282884 0.252314 0.246654 0.224517 0.204744 0.229451 0.225509 0.251146 0.225872 0.191097 0.222593 0.228815 0.221761 0.189272 0.188693 0.224515 0.223529
chargesum: 0.00000
title: Mulliken charges with hydrogens summed into heavy atoms:
elementType: Cl O N C C C C C C C C C C C C C C C C C C C C
charge: -0.078082 -0.316281 -0.085921 -0.009322 -0.292401 0.004098 0.034060 0.302139 0.278674 0.484170 0.397361 -0.160450 -0.135784 -0.373131 -0.223849 0.149369 0.007157 -0.030056 -0.014870 -0.008779 0.023105 0.026575 0.022218
polarizability: 2.78341865e+02 -5.40392429e-01 2.38267719e+02 1.20115227e+01 5.92015157e+00 1.62569138e+02
1716.lowfreq: -12.7178 -7.6303 -3.6812 0.0006 0.0010 0.0016 18.6671 22.6420 46.0635
frequency: 18.2023 22.5139 46.0589 60.3898 72.6054 94.7200 122.7737 142.0765 156.9395 176.3719 180.3505 187.6157 206.6384 217.9287 222.6389 239.2743 253.1871 324.6199 333.8072 351.3728 357.0851 366.7353 389.8945 423.7695 437.4428 451.7775 472.0229 476.4102 496.4142 522.9937 569.6956 583.4041 600.4999 607.8002 649.7220 706.9533 723.7410 744.0876 764.1539 780.4911 787.1947 811.5466 815.4393 821.0092 830.0360 849.0813 880.0604 888.3666 897.2808 915.7952 950.1210 959.9232 979.1127 986.6685 1003.0461 1023.3642 1028.4071 1033.2103 1034.8753 1036.0114 1048.8646 1061.6091 1074.8334 1086.4697 1094.2611 1109.9623 1137.7477 1140.7652 1146.1365 1165.1254 1171.2040 1172.4039 1176.9616 1185.1961 1193.1410 1209.4944 1235.7826 1238.1016 1259.2048 1264.1444 1266.8239 1286.2958 1297.3561 1306.7344 1322.3706 1331.8480 1384.3636 1386.9414 1390.9510 1420.2407 1432.1390 1437.7266 1443.7674 1445.0232 1460.8031 1462.4465 1464.5916 1465.9252 1475.4523 1476.9622 1483.0033 1485.2255 1495.4493 1571.7554 1593.4970 1610.6978 1618.7830 2848.0973 2853.5272 2870.4188 2970.5030 3004.0165 3017.7607 3020.4350 3025.8672 3029.4953 3050.3886 3061.3562 3077.3996 3079.3059 3084.3597 3084.8165 3122.3752 3132.3429 3141.3373 3146.7813 3161.6344 3169.1995 3181.1604
redmass: 4.7460 2.5465 5.4200 5.4052 5.4746 2.4766 2.9777 4.2105 3.8418 2.9033 4.4269 2.4814 2.1980 1.2769 2.9207 4.7592 1.3333 3.5969 3.9056 2.8022 5.6622 4.3045 4.3918 2.6899 3.7651 4.4375 3.9929 5.5468 4.5537 4.3388 4.9149 4.4989 5.5127 4.3458 5.5254 5.4685 4.8894 3.6954 1.2739 1.5700 2.2616 2.9099 1.6310 2.4457 2.7584 4.3299 2.2309 1.6470 2.0338 1.3963 1.4261 7.1181 1.3604 1.3200 4.1097 2.8459 2.5460 1.8765 2.1301 2.8766 2.7049 2.2685 1.9975 1.7848 1.7271 2.0374 1.5014 1.4834 1.5486 1.4166 1.4378 1.1470 1.6786 1.6527 2.2611 1.6176 1.3689 1.6990 2.1966 1.4877 2.4971 1.2262 1.4975 1.5404 1.4217 1.4095 3.2114 1.8514 5.9801 1.1452 3.1301 2.5454 1.1870 2.3412 1.0875 1.0588 1.4681 1.3119 1.0695 1.0570 1.2828 1.0550 1.0837 6.9564 6.9687 7.8145 7.5376 1.0572 1.0641 1.0629 1.0560 1.0579 1.0619 1.0728 1.0861 1.0819 1.0976 1.1048 1.0876 1.1009 1.1047 1.1016 1.0854 1.0896 1.0876 1.0939 1.1001 1.0934 1.0968
irintensity: 0.0379 0.6904 0.0699 0.3754 1.4379 0.2513 1.6103 2.9860 2.2357 0.4772 0.1536 0.2060 0.3816 1.7599 0.3432 3.4545 1.2159 9.6327 2.3801 5.3538 4.7959 0.5834 3.2883 1.5339 3.9501 0.9338 2.3722 1.0249 8.5027 3.1704 1.2969 4.7113 14.2721 1.0253 6.6045 7.6141 17.5791 13.0269 51.5901 54.8763 31.0475 0.9148 10.6804 8.2211 6.4301 1.3399 4.9173 3.3693 8.3067 0.7818 0.6757 57.3280 1.9490 0.3274 4.0651 3.7586 0.9796 45.4954 17.1244 11.7716 53.7545 21.5810 51.4034 12.7329 8.4411 3.1199 12.3276 9.4233 53.9626 11.5185 1.3883 1.3003 7.5856 10.4906 5.2490 13.0607 7.5083 6.9950 1.8336 2.5484 12.9391 6.9184 32.6190 20.0841 1.9977 1.0958 3.3897 3.1587 1.3006 2.6863 19.5464 44.5391 2.6800 2.2774 6.8532 16.3628 2.2532 9.3548 11.8228 27.3604 12.4134 12.7078 3.8918 25.6269 0.3435 3.2783 5.6338 68.4044 85.2707 187.3986 29.9848 28.6746 40.1228 39.6872 56.7925 16.3550 44.7198 0.3390 12.6232 26.6531 68.0331 40.3441 0.7202 8.0239 9.4750 26.8404 32.2564 4.6342 10.0663
temp: 298.150 k
press: 1.00000 atm
elementType: 17 8 7 6 6 6 6 6 6 6 6 6 6 6 6 6 6 6 6 6 6 6 6 1 1 1 1 1 1 1 1 1 1 1 1 1 1 1 1 1 1 1 1 1 1
symmnumber: 1
zpe: 970212.7 jmol-1
zpe.correction: 0.369534 hartree
zpe.thermalcorrener: 0.390489 hartree
zpe.thermalcorrenthalpy: 0.391433 hartree
zpe.thermalcorrgfe: 0.318602 hartree
zpe.sumelectzpe: -1363.666208 hartree
zpe.sumelectthermal: -1363.645254 hartree
zpe.sumelectthermalent: -1363.644310 hartree
zpe.sumelectthermalfe: -1363.717140 hartree
dipole: -2.8437 0.4989 0.4815
dipole: 2.9270
quadrupole: -139.7840 -133.7999 -142.8515
quadrupole: -0.3723 4.2660 2.8045
quadrupole: -0.9722 5.0119 -4.0397 -0.3723 4.2660 2.8045
hfenergy: -1364.0357424 hartree
pointgroup: C01 [X(C20H22Cl1N1O1)]
dipole: -1.1307508 0.1513163 0.1569958 debye
polarizability: 277.5695977|0.9972853|238.3582707|14.978062|6.0247983|163.250854 unknown
InChI: InChI=1S/C20H22ClNO/c1-22(2)12-13-23-20-11-10-15(14-6-3-4-7-16(14)20)19-17(20)8-5-9-18(19)21/h3-9,15H,10-13H2,1-2H3
charge 0 multiplicity 1
45 atoms
Cl 5.154914 -0.253964 0.364069
O  -1.292941 -0.991461 -0.102373
N  -5.020121 -0.981087 0.217489
C  -0.106098 -0.284933 0.36868
C  2.151007 0.883353 1.050297
C  0.013189 -0.217824 1.942919
C  1.354214 0.476483 2.346953
C  1.134179 -1.043014 -0.112297
C  0.017525 1.153368 -0.156837
C  2.351257 -0.405491 0.26032
C  1.232436 1.782963 0.228268
C  1.125874 -2.253223 -0.826553
C  -0.910512 1.830945 -0.969374
C  3.556341 -1.025274 -0.103973
C  1.50214 3.106194 -0.169468
C  -2.567036 -0.649876 0.559293
C  2.360901 -2.84556 -1.186609
C  -0.636933 3.161388 -1.372357
C  3.585461 -2.236233 -0.827538
C  0.558481 3.799776 -0.967415
C  -3.674539 -1.167002 -0.371572
C  -6.020015 -1.906956 -0.352883
C  -5.486238 0.420503 0.17358
H  3.10603 1.368428 1.305365
H  -0.03613 -1.250574 2.331611
H  -0.84658 0.342402 2.349255
H  1.159848 1.384496 2.944575
H  1.977611 -0.201748 2.955662
H  0.171146 -2.712289 -1.094022
H  -1.817311 1.321422 -1.311051
H  2.441525 3.589085 0.123712
H  -2.64483 -1.154272 1.541497
H  -2.641927 0.444655 0.714853
H  2.377358 -3.784227 -1.750882
H  -1.350892 3.695442 -2.009557
H  4.541829 -2.688893 -1.104655
H  0.763441 4.827914 -1.286215
H  -3.570141 -0.67616 -1.372727
H  -3.503992 -2.248168 -0.525486
H  -5.680218 -2.949572 -0.223195
H  -6.978952 -1.791801 0.183972
H  -6.214985 -1.737963 -1.442645
H  -5.611407 0.807039 -0.870873
H  -6.460737 0.501158 0.687117
H  -4.776672 1.082346 0.69907
