program: Gaussian 09
title: 000029238
version: EM64L-G09RevD.01
frameworkgroup: C1[X(C9H7ClN4O4)]
method: RPBEPBE
basis: SDD
operation: Freq
keyword: #p
keyword: freq=noraman
keyword: PBEPBE/SDD
title: #p freq=noraman PBEPBE/SDD
converged: NO YES NO NO
title: Mulliken charges:
elementType: Cl O O O O N N N N C C C C C C C C C H H H H H H H
charge: -0.037501 -0.178741 -0.262145 -0.204568 -0.200834 -0.419830 0.027057 0.017780 0.035788 0.310964 0.265893 0.448345 -0.494870 -0.288202 -0.366409 -0.223463 0.095892 -0.537283 0.337078 0.309039 0.296413 0.350254 0.230299 0.259784 0.229261
chargesum: 0.00000
title: Mulliken charges with hydrogens summed into heavy atoms:
elementType: Cl O O O O N N N N C C C C C C C C C
charge: -0.037501 -0.178741 -0.262145 -0.204568 -0.200834 -0.069576 0.027057 0.017780 0.035788 0.310964 0.265893 0.448345 -0.157792 0.020837 -0.069996 0.006836 0.095892 -0.048237
polarizability: 3.90539935e+02 -2.23312390e+01 1.98933997e+02 -3.14899156e-02 7.65722340e-03 5.50261564e+01
1716.lowfreq: -2.4130 -1.0816 -0.0021 -0.0010 0.0022 4.0870 36.8473 43.0436 46.2471
frequency: 36.7877 43.0366 46.2044 58.9970 75.0265 116.3810 136.5484 160.8014 163.1151 205.6296 235.8670 281.4097 301.1021 334.6852 352.3624 357.9642 380.9835 439.2527 442.2148 500.9123 516.6772 537.4635 562.8221 603.4878 628.4211 652.3551 653.7041 671.6374 679.2113 708.0332 726.6614 756.0364 822.7991 841.7827 870.3524 887.5237 910.5747 930.1182 962.3871 963.8894 1015.0506 1046.1397 1078.2122 1101.7818 1140.0013 1168.1708 1211.9028 1228.8903 1232.4905 1298.2823 1306.8957 1344.8481 1363.9028 1387.1770 1422.0666 1444.8862 1477.4196 1514.6761 1556.9287 1584.8272 1612.9826 1622.7367 3016.6529 3115.2342 3180.2904 3189.5906 3198.0169 3201.5144 3235.2534
redmass: 8.0877 6.5713 9.9780 13.8336 10.8494 6.2724 15.3612 12.2134 5.5710 3.8391 5.9511 5.2470 9.2594 5.5108 6.7478 6.5175 7.5956 6.1519 4.0937 9.6912 3.9235 4.8830 6.4159 5.6446 6.9520 4.7055 1.1346 5.8384 9.5456 7.4733 5.1744 12.8228 5.1952 1.1514 1.4049 7.0296 1.3699 1.4930 1.6786 1.4091 1.3193 2.5798 3.5870 3.9929 1.3680 8.4702 6.5149 3.2529 1.8039 1.7353 1.6277 4.7294 5.6647 2.8135 1.6652 5.3055 3.1143 3.1819 6.3804 5.1986 5.1842 6.8342 1.0883 1.0630 1.0893 1.0920 1.0969 1.0799 1.1142
irintensity: 3.8914 0.1845 0.4586 0.2052 1.2647 1.1836 1.2474 3.0555 3.5245 4.0800 3.3008 9.8602 2.9007 5.6524 10.4856 0.3544 3.4743 5.1118 1.7559 8.7360 14.4443 2.5793 1.3018 27.5851 4.6206 15.4310 1.1151 10.9776 5.5707 7.5211 1.7855 13.9605 7.4877 89.9159 24.2462 4.8342 12.3464 112.0890 5.1136 26.1575 0.1135 13.3964 188.6529 49.7090 77.8605 347.8991 474.5226 103.7594 94.3450 83.9110 49.4568 208.1767 69.9891 12.7242 32.1388 0.2245 87.7232 152.0472 26.5106 109.6310 76.3143 366.4541 13.6502 5.9635 3.4294 19.2524 0.2282 83.0201 2.1141
temp: 298.150 k
press: 1.00000 atm
elementType: 17 8 8 8 8 7 7 7 7 6 6 6 6 6 6 6 6 6 1 1 1 1 1 1 1
symmnumber: 1
zpe: 423789.3 jmol-1
zpe.correction: 0.161413 hartree
zpe.thermalcorrener: 0.177562 hartree
zpe.thermalcorrenthalpy: 0.178507 hartree
zpe.thermalcorrgfe: 0.115535 hartree
zpe.sumelectzpe: -1325.614287 hartree
zpe.sumelectthermal: -1325.598138 hartree
zpe.sumelectthermalent: -1325.597194 hartree
zpe.sumelectthermalfe: -1325.660165 hartree
dipole: -7.3990 1.0272 0.0078
dipole: 7.4700
quadrupole: -121.1052 -124.5117 -110.3013
quadrupole: -5.9340 0.0293 0.0056
quadrupole: -2.4658 -5.8723 8.3381 -5.9340 0.0293 0.0056
hfenergy: -1325.7757002 hartree
pointgroup: C01 [X(C9H7Cl1N4O4)]
dipole: -2.9345704 0.1600152 0.0030719 debye
dipolederiv: -0.1190852 0.0612814 -0.0000115 -0.141133 -0.6111835 -0.0000739 -0.0000578 -0.0001242 -0.0472869 -0.7888022 -0.4538759 -0.0003029 -0.4323497 -0.821327 -0.0000549 0.0016905 0.0016924 -0.2057487 -0.5207768 0.3679479 0.0005624 0.048265 -0.6413299 -0.0001957 -0.0000295 0.0008096 -0.2691426 -0.6542939 0.2040655 0.000194 0.4597509 -0.8594256 0.0001762 0.0008421 -0.0009801 -0.2280522 -1.1237574 -0.0163506 -0.000039 -0.2724611 -0.4411238 -0.0003623 0.0012936 0.0001187 -0.2238473 -2.0108864 0.0221583 0.0001843 -0.4190346 -0.2306363 -0.0001091 0.0003466 0.0000175 -0.2306784 0.90407 0.0063467 -0.0002053 0.5641037 1.9746236 -0.0002117 -0.0017945 -0.0022082 0.1946619 2.3321414 -0.5054761 -0.0006644 -0.526929 1.1737286 0.0004045 -0.0018331 0.0008247 0.1820432 0.708762 0.0905881 0.0000484 1.0861511 -0.0467312 0.0000802 0.0000709 0.0000989 -0.0918194 2.0387976 0.0289551 -0.0002584 -0.9330967 0.2402198 0.0001017 -0.0001681 -0.0001787 0.1273234 -0.6285196 0.3449784 0.0000806 -0.5638117 -0.8956961 0.0003538 0.0003074 -0.0000541 0.0063983 -1.1281728 0.2856801 0.0004474 0.2301791 -0.5946382 -0.000147 0.0003062 -0.0002937 0.0429844 0.2057001 -0.5062309 0.0000212 -0.2893305 0.4132428 0.0001241 -0.0005653 0.000088 -0.0441209 -0.5709887 0.1048729 0.0001095 0.8994368 -0.1028744 -0.0001076 -0.0000309 0.0000551 -0.1415293 0.8245826 0.0704816 -0.0001881 0.1782043 0.1394832 -0.0000592 -0.000344 0.0001986 -0.0776635 0.1074029 0.0281324 0.0001142 -0.128789 0.0905148 0.0000444 0.0004174 -0.0000076 -0.0430906 0.1068726 -0.2105079 0.0000574 0.4921577 1.0022969 0.0001347 0.0000093 0.0001354 -0.0484455 -0.4008654 0.1246824 0.0001057 -0.1714672 -0.1907646 0.0000619 -0.0000131 0.000053 -0.3390269 0.1707701 0.0027118 -0.0000206 -0.0165114 0.1402473 -0.0000123 0.0000553 0.000023 0.1796857 0.0906664 -0.0493489 0.0000271 -0.0443387 0.0794347 -0.0000281 -0.0000214 -0.0000888 0.1655661 0.1315813 0.0370009 -0.0000029 -0.0188011 0.0627426 -0.0000026 0.0000866 -0.0000685 0.1646604 0.1237507 0.0330659 -0.0000977 0.0859613 0.2675886 0.0000085 -0.0003416 -0.0000579 0.3295641 -0.0027981 -0.0306962 -0.0000522 -0.025127 -0.136544 -0.0000324 -0.0001208 0.0000164 0.1925621 0.0587353 -0.0530545 -0.0000684 -0.0336473 0.0579843 -0.0000508 -0.0000593 -0.0000476 0.2036315 0.1451132 0.0125914 -0.0000406 -0.0273817 -0.0698324 -0.0000421 -0.0000466 -0.0000219 0.2013711 unknown
polarizability: 392.9188483|-6.1000907|196.5550843|-0.0320187|0.0050049|55.0261564 unknown
InChI: InChI=1S/C9H7ClN4O4/c1-6(10)5-11-12-8-3-2-7(13(15)16)4-9(8)14(17)18/h2-5,12H,1H2
charge 0 multiplicity 1
25 atoms
Cl -4.526552 -2.400041 0.000231
O  1.943792 3.288994 -0.000851
O  -0.318374 3.036748 0.000132
O  4.130785 -2.59441 -0.001389
O  4.943492 -0.458323 -0.001144
N  -1.371021 0.652891 0.001562
N  0.899587 2.540177 0.00163
N  3.973317 -1.310793 0.000523
N  -2.414598 -0.247445 0.001318
C  -0.069353 0.184639 0.001435
C  1.059427 1.083459 0.00139
C  2.590625 -0.792547 0.000797
C  2.382933 0.590857 0.001006
C  0.196198 -1.222726 0.001082
C  1.501769 -1.708195 0.000789
C  -3.633911 0.252876 0.001139
C  -4.814629 -0.601843 0.000568
C  -6.091163 -0.127883 0.000139
H  3.225952 1.286426 0.000956
H  -0.662492 -1.896863 0.001049
H  1.710912 -2.781035 0.000555
H  -1.476315 1.690482 0.001588
H  -3.841165 1.339379 0.001108
H  -6.95738 -0.793258 -0.000339
H  -6.276437 0.952334 0.000224
