program: Gaussian 09
title: 000029251
version: EM64L-G09RevD.01
frameworkgroup: C1[X(C16H32O)]
method: RPBEPBE
basis: SDD
operation: Freq
keyword: #pfreq=noraman
keyword: PBEPBE/SDD
title: #p freq=noraman PBEPBE/SDD
converged: YES YES NO NO
title: Mulliken charges:
elementType: O C C C C C C C C C C C C C C C C H H H H H H H H H H H H H H H H H H H H H H H H H H H H H H H H
charge: -0.212134 -0.386323 -0.385759 -0.386155 -0.385018 -0.385058 -0.381817 -0.385830 -0.373024 -0.371536 -0.353205 -0.371078 -0.356849 -0.499112 -0.696679 0.217285 -0.771423 0.193260 0.193034 0.193746 0.193550 0.194528 0.194047 0.192642 0.192730 0.192698 0.192225 0.191949 0.191849 0.196716 0.195397 0.189180 0.189118 0.188971 0.187914 0.187644 0.187564 0.210326 0.223552 0.194652 0.194594 0.234373 0.228016 0.209618 0.214755 0.209676 0.239409 0.255298 0.230684
chargesum: 0.00000
title: Mulliken charges with hydrogens summed into heavy atoms:
elementType: O C C C C C C C C C C C C C C C C
charge: -0.212134 -0.000030 0.001536 0.002420 0.000354 -0.000135 0.001981 0.006283 0.005274 0.005350 0.022004 0.062800 0.032397 -0.036722 -0.062630 0.217285 -0.046031
polarizability: 2.38977135e+02 2.36593678e+00 1.57978495e+02 -1.03639151e+00 -5.87696710e-01 1.39233797e+02
1716.lowfreq: -13.3861 -6.0241 -0.0022 0.0013 0.0019 4.0025 9.6974 18.0179 21.1581
frequency: 9.1750 17.7500 20.2935 30.9582 40.3771 51.2344 57.0390 69.2312 84.1890 95.7580 99.9530 101.2659 115.8893 128.7343 132.2190 138.8730 150.2998 153.9829 157.3542 224.0928 229.6696 255.3486 298.8088 357.8288 374.0501 436.6370 442.7904 462.7739 496.0903 498.7412 582.4325 712.8446 718.8818 719.8626 723.4682 732.8777 750.9942 778.3637 811.7065 821.6791 856.2466 886.8159 899.6279 936.6145 943.3684 973.4852 977.1225 984.3804 1004.9268 1007.5492 1023.0233 1033.6137 1041.5129 1056.7744 1068.1211 1079.0390 1080.6745 1081.5926 1082.3384 1093.5660 1123.1949 1123.4810 1165.4038 1180.0189 1194.8643 1197.9568 1215.3767 1222.6242 1237.3374 1245.2310 1258.0627 1266.6898 1274.6381 1276.7593 1281.7976 1285.2284 1288.7015 1290.9975 1293.2096 1298.1098 1298.2244 1309.5703 1327.5512 1342.2092 1350.4709 1351.8546 1353.6032 1355.5721 1357.9967 1368.1012 1386.9704 1428.3513 1443.8214 1456.6463 1458.2634 1458.4573 1460.4994 1461.1024 1463.1051 1463.7374 1467.0939 1471.4306 1475.8910 1476.6687 1480.3172 1484.1487 1487.0963 1488.7457 1635.7088 2947.1177 2947.9448 2948.1592 2949.1935 2950.0327 2950.7148 2951.1536 2953.4158 2957.1251 2961.0860 2964.5296 2967.6931 2971.0876 2979.5534 2980.5977 2982.3582 2984.9543 2988.4360 2990.9418 2994.1191 2996.2724 3001.3821 3010.5489 3019.9512 3028.8508 3036.6600 3042.5868 3056.1733 3066.2889 3067.6316 3070.0525 3118.4231
redmass: 4.0086 3.5590 2.4176 3.6285 1.7174 3.9859 3.1521 1.6168 2.2069 2.1725 2.1187 1.3516 2.2046 1.8332 4.7459 2.1196 1.9883 2.0609 3.6542 3.5999 1.1155 4.1583 3.2540 3.6458 3.0603 2.9593 3.0878 2.1472 2.9276 3.0703 4.0015 1.1067 1.0575 1.0666 1.0862 1.1202 1.1628 1.2083 1.4410 2.4703 1.2612 1.9074 1.2493 1.5794 1.5406 1.2817 4.0942 4.7536 1.2520 3.0591 3.6897 1.0669 3.3282 3.0402 2.7806 2.0882 2.4008 2.2482 2.1283 2.9153 2.0661 2.2246 1.9601 1.9317 1.6709 1.3169 1.4916 1.3525 1.3763 1.3504 1.2925 1.3447 1.1900 1.0254 1.0627 1.1005 1.3171 1.1223 1.1011 1.1182 1.1095 1.3964 1.4484 1.5071 1.6658 1.6424 1.6850 1.6371 1.7021 1.2405 1.2166 1.0915 1.0665 1.0581 1.0735 1.0730 1.0718 1.0695 1.0619 1.0743 1.0837 1.0859 1.0815 1.0482 1.0893 1.0927 1.0953 1.0947 7.7715 1.0589 1.0583 1.0585 1.0587 1.0593 1.0595 1.0600 1.0594 1.0593 1.0589 1.0584 1.0585 1.0364 1.0383 1.0959 1.0964 1.0971 1.0947 1.0705 1.0958 1.0948 1.1025 1.1040 1.1049 1.1051 1.1049 1.1045 1.1030 1.0950 1.1007 1.0993 1.1005
irintensity: 0.0747 0.8787 2.4378 0.1253 0.8763 0.7092 0.1897 0.0648 0.1745 0.6733 0.8513 0.1854 0.1704 0.0040 0.0175 0.0812 0.0102 0.0278 2.0382 2.2309 0.0043 0.4838 0.7255 1.0921 0.6835 0.1180 3.1784 1.4566 0.0635 1.4138 4.8292 8.4290 20.8998 0.0425 3.6603 0.8594 0.5276 0.5092 0.8127 0.5161 0.1364 4.8360 1.7610 6.7991 3.1079 3.2099 0.1906 0.2632 0.4436 0.4564 0.9747 0.5604 0.0596 0.2365 0.2781 0.7764 0.2363 0.9464 0.2673 10.7007 3.6934 5.2380 32.7031 0.1008 0.0922 51.7750 0.0461 9.9521 0.0816 14.4529 0.2263 12.2853 0.2239 0.0618 0.2990 1.1471 9.6009 0.0977 0.6226 0.0111 0.0478 11.8280 8.3562 8.9969 1.5886 1.7953 1.9717 1.4908 9.0716 61.4551 11.2303 23.2408 21.2877 17.4591 0.0807 0.1657 0.1217 0.1277 0.0928 0.2342 0.7587 1.0620 3.1782 10.9224 1.6014 2.9255 6.4740 43.2302 105.0196 2.1428 0.2620 0.2785 0.5471 2.0969 5.2107 17.1106 0.1348 4.7096 0.2074 165.5913 222.6871 38.1211 4.9265 0.1712 0.6265 1.5195 6.0252 28.3416 5.3744 7.0748 0.2756 1.1483 0.1350 12.2566 0.0484 306.7134 103.6822 19.9488 99.9600 55.6974 15.4547
temp: 298.150 k
press: 1.00000 atm
elementType: 8 6 6 6 6 6 6 6 6 6 6 6 6 6 6 6 6 1 1 1 1 1 1 1 1 1 1 1 1 1 1 1 1 1 1 1 1 1 1 1 1 1 1 1 1 1 1 1 1
symmnumber: 1
zpe: 1167033.9 jmol-1
zpe.correction: 0.444500 hartree
zpe.thermalcorrener: 0.467989 hartree
zpe.thermalcorrenthalpy: 0.468933 hartree
zpe.thermalcorrgfe: 0.385412 hartree
zpe.sumelectzpe: -702.706861 hartree
zpe.sumelectthermal: -702.683372 hartree
zpe.sumelectthermalent: -702.682428 hartree
zpe.sumelectthermalfe: -702.765949 hartree
dipole: 0.2758 -3.0496 0.3263
dipole: 3.0794
quadrupole: -114.4417 -115.6240 -107.1067
quadrupole: 24.6136 -2.9660 0.1883
quadrupole: -2.0509 -3.2332 5.2841 24.6136 -2.9660 0.1883
hfenergy: -703.151361 hartree
pointgroup: C01 [X(C16H32O1)]
dipole: -0.1118186 -1.1789035 -0.255901 debye
polarizability: 238.9690456|-2.6061641|157.6632319|-0.6095202|2.5432166|139.5571505 unknown
InChI: InChI=1S/C16H32O/c1-3-4-5-6-7-8-9-10-11-12-13-14-15-16(2)17/h3-15H2,1-2H3
charge 0 multiplicity 1
49 atoms
O  7.925418 1.428103 0.371848
C  -1.137258 -0.510441 0.001778
C  -2.416972 0.355872 0.00002
C  0.165155 0.321271 0.015324
C  -3.720261 -0.474495 -0.014584
C  1.445605 -0.543938 0.018176
C  -4.999215 0.392992 -0.015062
C  2.74663 0.28972 0.030119
C  -6.303361 -0.436262 -0.030513
C  4.028115 -0.574001 0.033057
C  -7.581802 0.432056 -0.029629
C  5.3223 0.268968 0.048059
C  -8.886541 -0.397105 -0.046288
C  6.594723 -0.598112 0.041631
C  -10.157836 0.4794 -0.044374
C  7.903185 0.19354 0.121419
C  9.189198 -0.590344 -0.1305
H  -1.151569 -1.183014 0.885097
H  -1.140954 -1.170898 -0.890769
H  -2.41343 1.01583 0.892858
H  -2.402097 1.029129 -0.882725
H  0.168151 0.982324 0.907278
H  0.179433 0.993399 -0.868232
H  -3.724568 -1.133797 -0.907972
H  -3.735076 -1.148283 0.867802
H  1.431856 -1.215053 0.902655
H  1.442003 -1.205767 -0.873426
H  -4.995012 1.051869 0.878592
H  -4.983935 1.067374 -0.896957
H  2.75014 0.951481 0.921222
H  2.759877 0.961024 -0.853833
H  -6.318534 -1.111241 0.8510
H  -6.30832 -1.094416 -0.924786
H  4.02355 -1.235772 -0.858874
H  4.012947 -1.245403 0.917723
H  -7.578675 1.089697 0.8650
H  -7.567702 1.107731 -0.910616
H  5.339108 0.947452 -0.82726
H  5.33737 0.926503 0.937821
H  -8.899428 -1.072432 0.833685
H  -8.88884 -1.053275 -0.940745
H  6.584023 -1.301209 0.903666
H  6.631554 -1.248687 -0.857544
H  -10.182131 1.142865 -0.92961
H  -11.076428 -0.135891 -0.057641
H  -10.193895 1.12194 0.855764
H  9.328252 -0.720552 -1.222044
H  10.057212 -0.03935 0.264553
H  9.144837 -1.600699 0.31464
