program: Gaussian 09
title: 000029285
version: EM64L-G09RevD.01
frameworkgroup: C1[X(C18H24N2S)]
method: RPBEPBE
basis: SDD
operation: Freq
keyword: #p
keyword: freq=noraman
keyword: PBEPBE/SDD
title: #p freq=noraman PBEPBE/SDD
converged: YES YES NO NO
title: Mulliken charges:
elementType: S N N C C C C C C C C C C C C C C C C C C H H H H H H H H H H H H H H H H H H H H H H H H
charge: 0.162703 -0.029647 -0.086789 -0.384483 -0.390173 -0.557249 -0.394237 0.387424 -0.502485 -0.042140 -0.447381 0.410628 -0.101386 -0.665188 -0.345372 -0.323413 -0.298190 -0.266911 -0.237478 -0.613466 -0.616266 0.213235 0.207008 0.236186 0.200419 0.205515 0.186734 0.206494 0.214811 0.197857 0.239644 0.279384 0.284505 0.250042 0.264145 0.220097 0.191884 0.226914 0.231189 0.188696 0.226296 0.227534 0.190661 0.228104 0.224145
chargesum: 0.00000
title: Mulliken charges with hydrogens summed into heavy atoms:
elementType: S N N C C C C C C C C C C C C C C C C C C
charge: 0.162703 -0.029647 -0.086789 0.035760 0.002076 -0.120644 0.027069 0.387424 -0.064984 -0.042140 -0.447381 0.410628 -0.101386 -0.101299 -0.095331 -0.059268 0.113790 -0.039996 -0.006288 0.029060 0.026644
polarizability: 3.00310741e+02 2.07447896e+01 2.62734970e+02 -2.12097383e+01 5.87578127e-01 1.47317119e+02
1716.lowfreq: -15.2625 -3.1091 -1.1945 -0.0013 -0.0008 0.0013 15.1960 24.2212 31.2803
frequency: 11.7569 23.3478 31.0368 53.4061 75.9439 83.2247 91.8652 143.7013 151.4598 167.0763 179.8959 207.4498 213.3447 231.7699 248.5370 262.8001 266.8205 318.7419 333.8967 340.2935 365.2257 374.4290 390.6124 418.4544 435.5891 443.5753 446.4642 479.6185 519.9414 537.1745 567.5577 604.0209 630.4283 648.5989 680.8365 731.2931 742.9625 764.1361 778.1053 789.5235 801.5082 816.5013 831.6937 849.6384 860.2466 881.6456 886.8350 929.8632 956.3885 960.1471 969.6855 990.1893 994.7308 1020.8079 1020.9992 1035.8110 1039.6772 1065.6209 1069.9992 1090.4544 1091.1117 1112.6637 1115.2851 1124.8141 1137.5590 1145.0529 1162.0102 1199.7820 1206.8141 1219.7818 1233.6240 1246.0894 1252.4898 1260.2046 1266.5926 1271.1923 1292.8407 1296.9388 1316.5773 1325.3797 1338.1574 1341.7357 1355.2613 1362.8003 1364.8638 1376.6852 1407.3962 1421.7968 1442.0594 1442.3166 1449.3225 1459.3556 1462.8632 1463.3773 1463.7962 1467.2142 1470.0705 1471.6687 1474.1082 1477.8158 1478.6091 1485.4552 1547.4984 1557.6708 1616.3181 2851.0331 2854.0339 2871.3103 2956.4033 2969.2569 2971.9244 2976.0207 2977.1110 3017.0021 3020.8094 3027.5563 3030.8191 3031.7424 3040.6113 3045.8993 3057.1482 3069.0770 3079.1676 3087.0331 3124.9247 3126.0931 3138.8737 3153.2274 3168.9577
redmass: 3.6462 3.4392 3.5158 3.7592 3.9665 3.3491 2.2190 3.5213 2.9013 2.7363 4.0353 4.3988 1.0898 1.3795 2.7741 3.0997 2.9651 3.8493 2.7562 2.5068 4.1404 3.0905 3.6081 3.2727 2.7762 3.1403 4.3215 2.1005 2.7364 3.3552 3.8373 5.2964 5.5083 4.7087 6.2991 3.6530 3.4355 1.1894 1.3319 4.1942 3.1162 4.2253 1.5515 3.3002 2.3868 2.7267 1.6639 4.2553 1.8813 2.1295 1.3614 1.3796 1.3166 2.4858 2.1334 1.5755 2.1552 2.8012 1.8764 1.3619 2.1080 1.9197 1.2960 1.6149 1.4309 1.5494 1.1609 1.3767 1.3216 1.4802 2.1447 1.7307 1.4589 1.6910 2.4431 1.3331 1.7848 1.3388 1.3999 1.4985 1.8440 1.5737 1.4656 2.8789 1.3837 2.4782 7.4518 1.1388 1.1680 2.1857 1.0960 1.2308 1.0864 1.0512 1.0940 1.0697 1.9573 1.2950 1.0617 1.0814 1.1542 1.0536 7.4778 8.2927 6.5166 1.0576 1.0647 1.0613 1.0617 1.0667 1.0662 1.0632 1.0606 1.0958 1.0732 1.0805 1.0806 1.1026 1.1024 1.0571 1.0942 1.0946 1.1009 1.1005 1.1075 1.0862 1.0895 1.0951 1.0995
irintensity: 0.3134 0.2880 0.1892 0.9692 0.8805 0.2097 2.3746 0.0772 0.3256 1.1217 1.7379 0.3495 1.3865 0.5812 2.7169 2.7118 1.0184 3.1380 1.2250 9.3709 0.6554 1.0891 0.6655 2.3234 0.6815 2.6132 1.3013 1.8139 2.5717 0.3660 0.1758 1.2549 7.3691 0.9734 33.0329 1.7705 4.2702 17.0886 78.0548 7.2960 0.8568 18.6695 13.4058 1.7685 6.7365 9.0328 0.7243 0.4763 7.5804 37.2746 2.8013 2.0336 0.1692 25.3135 9.0445 26.3185 2.4176 32.9914 3.5153 4.3913 0.8497 1.4113 32.8991 0.3857 2.1622 6.2695 3.4449 15.0078 14.1183 3.6503 5.9869 8.5955 14.1846 0.9636 9.5457 2.8457 10.7428 1.0909 2.2414 0.9607 15.0502 5.2178 0.6946 8.6286 1.7922 12.3721 40.3791 2.6836 2.8443 5.7564 0.2379 8.2105 3.7580 14.5236 2.6819 3.1401 25.3659 29.2539 18.4919 24.1835 26.7951 10.1337 14.3228 22.7531 1.3258 57.6553 86.6351 200.2242 37.0320 8.3347 38.2615 33.0558 36.2478 85.4543 43.4856 34.7251 20.8353 18.6832 97.6994 17.0550 13.9059 17.5877 25.8096 49.5362 12.1132 2.0950 6.1843 21.7817 27.8371
temp: 298.150 k
press: 1.00000 atm
elementType: 16 7 7 6 6 6 6 6 6 6 6 6 6 6 6 6 6 6 6 6 6 1 1 1 1 1 1 1 1 1 1 1 1 1 1 1 1 1 1 1 1 1 1 1 1
symmnumber: 1
zpe: 998752.7 jmol-1
zpe.correction: 0.380405 hartree
zpe.thermalcorrener: 0.401081 hartree
zpe.thermalcorrenthalpy: 0.402025 hartree
zpe.thermalcorrgfe: 0.328891 hartree
zpe.sumelectzpe: -1206.298106 hartree
zpe.sumelectthermal: -1206.277430 hartree
zpe.sumelectthermalent: -1206.276486 hartree
zpe.sumelectthermalfe: -1206.349620 hartree
dipole: 1.8986 -0.8965 -0.0298
dipole: 2.0998
quadrupole: -117.3842 -128.9379 -138.4927
quadrupole: 7.9955 -2.2843 -1.6937
quadrupole: 10.8874 -0.6663 -10.2211 7.9955 -2.2843 -1.6937
hfenergy: -1206.6785111 hartree
pointgroup: C01 [X(C18H24N2S1)]
dipole: 0.8069417 0.1751245 0.0255601 debye
polarizability: 289.329962|-28.3302636|273.6034976|18.9191189|5.1202626|147.4293692 unknown
InChI: InChI=1S/C18H24N2S/c1-20(2)12-13-21-18-14-8-4-3-5-10-16(14)19-17-11-7-6-9-15(17)18/h6-7,9,11H,3-5,8,10,12-13H2,1-2H3
charge 0 multiplicity 1
45 atoms
S  1.35399 1.341779 1.028285
N  -2.428921 -0.839606 -0.738437
N  5.055684 0.330021 -0.631402
C  -2.339032 3.305642 0.971651
C  -3.7950 3.34234 0.451329
C  -1.30383 2.751098 -0.054529
C  -4.39451 1.971578 0.058905
C  -1.24573 1.235347 -0.109605
C  -3.639591 1.237475 -1.088051
C  -2.389539 0.503189 -0.632184
C  -0.138322 0.488776 0.332262
C  -0.166088 -0.955533 0.285025
C  -1.340584 -1.575887 -0.292248
C  2.656939 0.897972 -0.303774
C  0.879796 -1.80102 0.777907
C  -1.407588 -3.001017 -0.398609
C  4.018759 0.657141 0.372963
C  0.786031 -3.1919 0.670576
C  -0.359948 -3.798861 0.067972
C  4.976918 -1.061951 -1.119236
C  6.421009 0.689616 -0.198632
H  -2.281932 2.710148 1.904152
H  -2.039028 4.338155 1.238493
H  -0.30064 3.131384 0.203037
H  -1.557594 3.151597 -1.057635
H  -4.440465 3.807891 1.223209
H  -3.83556 4.011641 -0.434249
H  -5.440802 2.1314 -0.268142
H  -4.441321 1.307452 0.944669
H  -3.39093 1.975199 -1.878877
H  -4.299078 0.476818 -1.539009
H  2.286192 0.000459 -0.823044
H  2.719255 1.734375 -1.016347
H  1.742066 -1.337269 1.269413
H  -2.309407 -3.429303 -0.846838
H  4.326686 1.580665 0.898405
H  3.912977 -0.138178 1.154481
H  1.59092 -3.824328 1.061656
H  -0.418686 -4.889837 -0.012857
H  5.210185 -1.815936 -0.324274
H  5.692836 -1.204844 -1.948017
H  3.967692 -1.279564 -1.508122
H  6.781424 0.098153 0.681015
H  6.459981 1.760606 0.067744
H  7.127789 0.520913 -1.031132
