program: Gaussian 09
title: 000029245
version: EM64L-G09RevD.01
frameworkgroup: C1[X(C14H12O3)]
method: RPBEPBE
basis: SDD
operation: Freq
keyword: #pfreq=noraman
keyword: PBEPBE/SDD
title: #p freq=noraman PBEPBE/SDD
converged: YES YES NO NO
title: Mulliken charges:
elementType: O O O C C C C C C C C C C C C C C H H H H H H H H H H H H
charge: -0.461026 -0.438190 -0.228054 0.245355 0.206399 0.346697 0.087263 -0.370493 -0.369352 -0.373236 -0.538465 -0.231363 -0.340319 -0.247293 -0.237690 -0.234707 0.059827 0.242865 0.305204 0.231074 0.218391 0.204983 0.227961 0.274490 0.226736 0.233948 0.234766 0.342828 0.381402
chargesum: 0.00000
title: Mulliken charges with hydrogens summed into heavy atoms:
elementType: O O O C C C C C C C C C C C C C C
charge: -0.118198 -0.056788 -0.228054 0.245355 0.206399 0.346697 0.087263 -0.127628 -0.064149 -0.142163 -0.115092 -0.003402 -0.065829 -0.020557 -0.003742 0.000059 0.059827
polarizability: 2.03871618e+02 -1.79539556e+01 1.73973122e+02 6.88381915e+00 2.75398237e+00 1.02808693e+02
1716.lowfreq: -5.6071 0.0005 0.0009 0.0009 5.1279 9.2879 28.8430 51.0877 68.8344
frequency: 28.8158 51.0755 68.8140 84.4755 108.0553 134.4923 139.7422 188.0515 239.9559 255.5447 265.2913 293.5133 344.3940 383.1196 392.9198 408.4052 489.1035 502.5273 540.3898 564.1275 588.4613 590.9944 599.6594 620.1278 679.1817 702.2203 750.2815 756.6163 772.0934 778.5982 790.6187 817.0059 880.7107 895.6350 926.1726 957.6615 972.9312 976.6271 988.3015 989.4476 997.7994 1001.9323 1046.9574 1048.8702 1111.7077 1117.0408 1160.3255 1162.2332 1174.7995 1179.5522 1194.2791 1233.4431 1262.9065 1285.3827 1302.9504 1305.6084 1370.3043 1376.2096 1395.7979 1422.4520 1442.0319 1470.6522 1482.4376 1497.8780 1569.6854 1586.1441 1602.0475 1613.4846 1644.3704 2963.1831 3017.6540 3120.5077 3126.5008 3132.0413 3142.0038 3151.3507 3162.0972 3164.8734 3179.4449 3522.3326 3540.3887
redmass: 5.7933 9.0219 5.1179 5.0822 4.0030 4.5865 4.5202 5.6836 4.8671 1.1236 4.7382 4.7831 4.9848 3.5937 3.9946 3.2612 4.1056 4.6709 4.0182 3.5013 3.8977 1.5322 3.1156 6.3163 4.4311 4.2379 4.2463 1.7217 2.5305 2.1974 2.0851 3.9059 1.4829 1.4620 5.0971 1.4765 1.5085 1.5660 4.8411 1.3588 6.3766 1.3685 2.2452 2.3140 1.8910 1.6198 1.3816 1.6739 1.0593 1.0723 1.1018 1.6860 1.9283 1.5327 2.4876 1.6887 7.7557 6.1722 1.4015 2.0887 2.4523 2.4089 1.1168 2.9854 6.6019 7.2158 6.0133 6.4391 8.7136 1.0563 1.1071 1.0856 1.0892 1.0865 1.0943 1.0917 1.1008 1.0964 1.0971 1.0641 1.0662
irintensity: 0.7345 1.3890 0.9886 0.1274 1.0917 5.0021 2.0984 0.9626 0.8479 159.8996 1.0806 3.5730 7.6032 0.6822 3.4494 7.9340 4.2610 4.8382 17.6130 11.1161 11.8768 77.0408 41.1224 8.6985 23.3054 40.3025 4.0849 77.7714 38.8363 23.8562 26.8653 12.4472 7.9694 5.1041 43.0095 0.9818 17.8265 6.3114 216.6546 6.4851 28.0605 7.4855 2.0150 17.6291 36.2868 24.9714 10.3705 104.8254 0.2459 2.0495 1.1898 10.4611 4.2250 2.0267 68.7443 7.3208 8.5530 0.8827 13.3765 2.9550 2.7849 38.3343 6.0084 5.2962 16.6914 2.9382 6.3178 0.8946 246.2191 56.8124 40.9930 5.7247 4.0848 5.6533 28.3804 14.9097 33.1651 6.8925 11.8493 38.0416 3.6816
temp: 298.150 k
press: 1.00000 atm
elementType: 8 8 8 6 6 6 6 6 6 6 6 6 6 6 6 6 6 1 1 1 1 1 1 1 1 1 1 1 1
symmnumber: 1
zpe: 584960.9 jmol-1
zpe.correction: 0.222800 hartree
zpe.thermalcorrener: 0.237708 hartree
zpe.thermalcorrenthalpy: 0.238652 hartree
zpe.thermalcorrgfe: 0.179908 hartree
zpe.sumelectzpe: -765.161677 hartree
zpe.sumelectthermal: -765.146769 hartree
zpe.sumelectthermalent: -765.145825 hartree
zpe.sumelectthermalfe: -765.204569 hartree
dipole: -1.1068 1.1584 0.8452
dipole: 1.8114
quadrupole: -88.1130 -85.7131 -96.7997
quadrupole: -0.9821 2.0923 7.0640
quadrupole: 2.0956 4.4955 -6.5911 -0.9821 2.0923 7.0640
hfenergy: -765.3844768 hartree
pointgroup: C01 [X(C14H12O3)]
dipole: -0.5322914 -0.2895083 -0.3751271 debye
polarizability: 209.8909895|11.0110839|164.5894156|-6.4867235|14.3402359|106.1730274 unknown
InChI: InChI=1S/C14H12O3/c15-9-10-5-1-2-6-11(10)12-7-3-4-8-13(12)14(16)17/h1-8,15-16H,9H2
charge 0 multiplicity 1
29 atoms
O  1.299898 -2.934225 -1.214496
O  -2.314498 3.014075 -0.024725
O  -0.272517 2.454157 -0.967051
C  0.8045 -0.011178 0.270137
C  -0.662963 -0.314662 0.206012
C  1.749531 -0.62527 -0.602676
C  -1.664243 0.697328 0.053495
C  1.2730 0.853937 1.293824
C  -1.090292 -1.649518 0.436366
C  3.128921 -0.351936 -0.431227
C  1.317773 -1.535748 -1.72963
C  2.648232 1.114197 1.456277
C  -3.040506 0.366725 0.183601
C  3.58587 0.506878 0.589892
C  -2.460306 -1.973364 0.538927
C  -3.441117 -0.96078 0.429608
C  -1.303395 2.085276 -0.357506
H  0.546818 1.315411 1.972922
H  -0.327231 -2.427908 0.532754
H  3.848943 -0.823267 -1.111011
H  0.310581 -1.2552 -2.097025
H  2.039287 -1.460766 -2.568664
H  2.986627 1.784336 2.254338
H  -3.782137 1.162273 0.072839
H  4.657023 0.703952 0.707683
H  -2.758872 -3.012166 0.719413
H  -4.504595 -1.204333 0.525036
H  1.051821 -3.540106 -1.960119
H  -2.038651 3.905681 -0.370094
