program: Gaussian 09
title: 000029264
version: EM64L-G09RevD.01
frameworkgroup: C1[X(C21H25NO)]
method: RPBEPBE
basis: SDD
operation: Freq
keyword: #p
keyword: freq=noraman
keyword: PBEPBE/SDD
title: #p freq=noraman PBEPBE/SDD
converged: YES YES NO NO
title: Mulliken charges:
elementType: O N C C C C C C C C C C C C C C C C C C C C C H H H H H H H H H H H H H H H H H H H H H H H H H
charge: -0.297519 -0.079898 -0.037832 -0.029790 -0.446544 -0.483674 0.319284 0.318784 0.260816 0.262131 -0.830089 -0.424034 -0.425489 -0.401206 -0.434075 -0.257843 -0.252955 -0.251876 -0.252869 -0.232890 -0.369559 -0.614824 -0.617267 0.220302 0.225637 0.237213 0.231797 0.222132 0.223824 0.224727 0.250195 0.248071 0.252977 0.292300 0.207404 0.194336 0.222050 0.219803 0.223794 0.222941 0.171703 0.220330 0.232960 0.183122 0.220761 0.220530 0.226830 0.183480
chargesum: 0.00000
title: Mulliken charges with hydrogens summed into heavy atoms:
elementType: O N C C C C C C C C C C C C C C C C C C C C C
charge: -0.297519 -0.079898 -0.037832 -0.029790 -0.000606 -0.014665 0.319284 0.318784 0.260816 0.262131 -0.159406 -0.173839 -0.177417 -0.148229 -0.141775 0.143898 -0.030906 -0.032072 -0.029075 -0.009949 0.022473 0.022019 0.013573
polarizability: 2.59761824e+02 3.21593409e+00 2.46851338e+02 -9.27248881e+00 6.24189267e-01 1.72918569e+02
1716.lowfreq: -5.0754 -3.4500 -0.0008 -0.0007 -0.0005 10.5801 13.6057 25.6749 34.3959
frequency: 9.7223 25.5904 34.0341 65.6029 92.3772 107.1995 133.2825 156.9517 161.5143 196.7632 209.4746 218.8575 223.4999 241.4610 256.8983 265.2167 274.4394 280.7333 300.0817 337.0468 351.0010 370.8361 410.2849 422.0550 426.1700 432.1207 455.4875 461.8739 467.4889 526.4064 544.3898 569.7992 593.5334 605.7589 623.6748 655.0640 678.1094 730.4933 750.5245 754.2074 759.4653 766.3288 768.6947 806.4506 821.2767 849.1335 871.2740 880.8161 887.3431 892.0965 946.4302 952.2731 956.4724 983.7436 988.3646 993.9261 1011.4210 1018.4355 1023.3803 1033.7827 1035.5613 1038.2303 1042.7563 1051.3905 1063.4776 1071.1138 1087.7963 1093.1638 1104.6851 1118.1661 1131.7943 1144.8537 1150.6039 1172.1121 1172.3227 1173.2083 1189.6011 1201.2720 1221.9829 1237.2028 1247.3099 1254.1214 1272.8056 1280.1737 1291.4568 1298.9209 1305.2101 1315.6909 1363.7057 1374.4416 1383.2096 1391.2512 1392.3299 1416.8315 1434.2399 1440.6456 1441.5217 1450.4840 1455.7489 1460.5408 1460.7068 1468.0357 1469.7803 1475.5611 1480.1076 1481.5464 1484.5884 1485.3787 1485.9092 1585.4857 1596.7315 1609.5101 1618.4717 2822.4182 2832.4840 2851.0753 2952.1341 2980.8538 2992.3013 3004.1178 3010.0367 3017.8520 3022.5069 3041.7738 3049.5966 3073.6006 3075.4235 3076.6839 3076.9617 3080.8268 3121.8063 3122.3955 3136.4704 3138.4248 3149.9560 3153.8263 3162.4685 3171.3434
redmass: 2.7056 4.0202 3.3716 4.7366 3.7015 3.4142 3.3420 3.6975 3.6387 1.9647 1.8301 2.0250 1.1012 3.2897 2.2900 2.6420 1.1436 2.3373 3.2840 3.4470 4.2571 1.9176 2.1890 4.0885 4.0866 4.4235 3.4820 4.5450 4.0498 3.9658 3.6482 3.9062 3.7221 3.9648 4.6466 4.2720 5.5969 5.3037 4.1228 2.6011 1.7920 1.5918 1.3888 3.6547 2.4979 2.5570 2.6285 1.3516 1.7083 1.5111 1.4074 1.9784 1.4676 1.3619 2.1571 1.5527 2.3024 2.6416 3.6833 2.4376 1.4747 3.3576 2.9509 2.2130 1.9459 2.7218 1.5937 2.0486 1.7599 2.4168 1.4346 1.6929 1.5194 1.1356 1.4627 1.0972 1.7926 2.2265 2.5482 1.4742 1.2630 2.2579 2.4615 1.4458 1.6062 1.4910 1.5042 1.8489 1.2989 1.4859 6.7532 1.5075 3.7697 1.1421 1.1258 2.3311 2.3512 2.4539 1.1175 1.0538 1.0917 1.3626 1.1513 1.0561 1.0873 1.0721 1.2553 1.1163 1.2215 6.6976 7.3030 6.9592 6.9895 1.0692 1.0581 1.0592 1.0570 1.0361 1.0581 1.0960 1.0656 1.0711 1.0709 1.0883 1.1045 1.1016 1.0994 1.1028 1.1008 1.1006 1.0851 1.0847 1.0894 1.0904 1.0939 1.0964 1.0993 1.0965
irintensity: 0.3367 0.5475 0.1690 0.6104 1.0075 1.0865 0.1374 1.7846 0.5132 1.0586 0.1005 1.5572 0.4095 3.1337 0.2170 0.1084 0.2255 4.7584 2.0066 0.5571 1.5374 5.4699 0.3378 1.9976 0.5070 0.8480 2.5014 3.7348 0.6427 1.0480 18.8090 22.8932 1.0782 4.0059 2.7570 2.0257 1.5115 1.0939 0.8027 5.4872 32.6676 48.9084 69.4889 0.2497 0.0315 7.3254 2.3519 0.2313 6.8259 0.0718 1.8557 23.5465 4.9502 0.0981 0.8572 0.9209 12.8229 22.1595 2.1327 4.6227 13.5000 19.7489 85.1373 6.6959 1.0763 59.4855 21.5906 24.6493 1.0922 4.1410 9.5757 8.0069 4.8983 5.8633 11.4409 2.3434 6.8425 19.0224 6.7592 5.8804 0.4204 7.2614 13.2435 0.1982 1.8300 6.0316 55.3022 3.3515 9.9861 5.3324 5.3921 14.7974 4.7191 2.9601 2.3633 6.3786 12.7183 48.9769 12.5336 14.9655 3.0951 1.0080 11.1042 17.4201 3.8622 7.6093 3.2106 12.6675 20.5438 1.0884 0.5992 0.4826 2.0699 60.2134 77.3545 303.5348 55.0276 21.3645 41.0036 23.3330 58.1692 35.9193 50.1686 31.0500 1.7922 1.0867 25.4671 75.1979 24.0010 57.8017 1.8079 0.2794 12.1880 20.6717 33.3328 33.8617 29.5358 13.3816
temp: 298.150 k
press: 1.00000 atm
elementType: 8 7 6 6 6 6 6 6 6 6 6 6 6 6 6 6 6 6 6 6 6 6 6 1 1 1 1 1 1 1 1 1 1 1 1 1 1 1 1 1 1 1 1 1 1 1 1 1
symmnumber: 1
zpe: 1066005.6 jmol-1
zpe.correction: 0.406020 hartree
zpe.thermalcorrener: 0.427036 hartree
zpe.thermalcorrenthalpy: 0.427980 hartree
zpe.thermalcorrgfe: 0.355392 hartree
zpe.sumelectzpe: -943.497670 hartree
zpe.sumelectthermal: -943.476654 hartree
zpe.sumelectthermalent: -943.475710 hartree
zpe.sumelectthermalfe: -943.548299 hartree
dipole: 0.7119 -1.2515 1.7551
dipole: 2.2702
quadrupole: -119.6163 -133.0448 -135.8336
quadrupole: -2.9821 -1.8066 0.3573
quadrupole: 9.8819 -3.5466 -6.3353 -2.9821 -1.8066 0.3573
hfenergy: -943.9036902 hartree
pointgroup: C01[X(C21H25N1O1)]
dipole: 0.3231601 -0.4832287 0.6780613 debye
polarizability: 259.0318964|4.3941388|247.4073587|-9.8598754|1.4248916|173.0924757 unknown
InChI: InChI=1S/C21H25NO/c1-20-12-13-21(23-15-14-22(2)3,18-10-6-4-8-16(18)20)19-11-7-5-9-17(19)20/h4-11H,12-15H2,1-3H3
charge 0 multiplicity 1
48 atoms
O  1.596451 -0.021039 -0.011857
N  4.606799 0.505895 0.090078
C  -2.412846 -0.079934 0.924396
C  0.196858 -0.094958 0.397764
C  -1.56359 -0.09146 2.261423
C  -0.031966 -0.105413 1.957986
C  -1.942475 -1.308773 0.126622
C  -1.918729 1.157104 0.150928
C  -0.550289 -1.310378 -0.166957
C  -0.524031 1.149081 -0.120894
C  -3.915272 -0.068559 1.238063
C  -2.751216 -2.368584 -0.330926
C  -2.697084 2.258622 -0.258439
C  0.020218 -2.339178 -0.93834
C  0.096917 2.220135 -0.786783
C  2.563476 -0.823238 0.75086
C  -2.17629 -3.4174 -1.090964
C  -2.082433 3.338328 -0.940651
C  -0.797474 -3.399179 -1.400912
C  -0.692869 3.320531 -1.202093
C  3.89216 -0.784585 -0.014932
C  5.498394 0.764829 -1.055919
C  5.291635 0.686242 1.382672
H  -1.851625 -0.981617 2.850603
H  -1.833491 0.804266 2.850234
H  0.466226 0.783741 2.384537
H  0.435653 -1.005986 2.393629
H  -4.201215 -0.963899 1.819355
H  -4.180957 0.818574 1.840921
H  -4.526006 -0.049869 0.316974
H  -3.824878 -2.381158 -0.115624
H  -3.773457 2.285188 -0.05811
H  1.08143 -2.296275 -1.203237
H  1.174563 2.181086 -0.968432
H  2.683118 -0.41295 1.773719
H  2.219051 -1.875844 0.838021
H  -2.807043 -4.23778 -1.452039
H  -2.688964 4.191215 -1.26684
H  -0.362239 -4.201286 -2.007821
H  -0.225413 4.160437 -1.728754
H  4.527666 -1.638843 0.342607
H  3.664753 -0.971857 -1.080534
H  4.919592 0.717233 -1.9950
H  6.353206 0.043616 -1.136186
H  5.92421 1.7811 -0.970322
H  4.574256 0.587476 2.216164
H  5.724328 1.701179 1.435135
H  6.118694 -0.052936 1.550873
