program: Gaussian 09
title: 000029227
version: EM64L-G09RevD.01
frameworkgroup: C1[X(C7H12N2O)]
method: RPBEPBE
basis: SDD
operation: Freq
keyword: #p
keyword: freq=noraman
keyword: PBEPBE/SDD
title: #p freq=noraman PBEPBE/SDD
converged: YES YES NO NO
title: Mulliken charges:
elementType: O N N C C C C C C C H H H H H H H H H H H H
charge: -0.216216 -0.613301 -0.007743 0.193516 -0.391913 -0.391967 0.163696 -0.695113 -0.695091 -0.221660 0.187871 0.225213 0.187835 0.225236 0.216200 0.231204 0.250655 0.250664 0.216207 0.231178 0.312077 0.341451
chargesum: 0.00000
title: Mulliken charges with hydrogens summed into heavy atoms:
elementType: O N N C C C C C C C
charge: -0.216216 0.040226 -0.007743 0.193516 0.021171 0.021104 0.163696 0.002947 0.002958 -0.221660
polarizability: 8.15561746e+01 6.10654928e-03 9.16898440e+01 -8.42300912e-03 -8.26453412e+00 8.46158039e+01
1716.lowfreq: -24.1485 -15.4451 -8.1509 -0.0002 0.0005 0.0008 27.1698 93.8770 100.3516
frequency: 24.7324 93.8699 100.3359 128.6811 148.3317 181.2944 187.5693 203.5158 264.9289 298.7411 371.5244 382.4833 420.0598 428.9902 477.3116 545.8090 584.8786 598.0387 633.1268 718.4957 759.9892 782.8613 901.4112 941.5533 942.8883 1035.7128 1046.9004 1071.9544 1076.5484 1087.3598 1146.5402 1183.7558 1251.0195 1276.5530 1301.2225 1320.0561 1353.2661 1402.1085 1403.1248 1459.6392 1471.1818 1478.2327 1479.0506 1484.2901 1484.6663 1587.7495 1641.3903 2199.3561 2978.4318 2984.1923 2989.1945 2989.8265 3034.8607 3041.2009 3085.3264 3085.7864 3089.7168 3090.5939 3518.7060 3671.0432
redmass: 5.5093 2.7660 2.3200 5.4338 4.3124 3.6972 1.4393 1.1782 1.5953 2.4527 3.5633 3.2076 5.5151 3.6684 1.1679 2.0071 4.9564 1.8070 3.4429 3.8537 1.3688 1.2274 1.7970 3.9535 1.7075 1.5699 2.0008 3.3870 1.3746 3.4609 2.5278 2.4842 1.1671 1.6928 1.3924 1.6142 1.8595 1.2000 1.2065 1.0751 1.0820 1.0391 1.0411 1.0538 1.0613 1.5374 3.2334 12.6420 1.0607 1.0592 1.0367 1.0377 1.1005 1.1003 1.1000 1.0997 1.1008 1.1006 1.0447 1.1041
irintensity: 9.8498 1.3608 0.0202 1.0101 2.7083 0.3366 0.0520 0.6153 0.0718 3.8394 0.5458 0.3802 3.8674 1.4311 138.3317 55.7219 2.3018 83.7700 7.7187 22.5662 15.9208 0.0503 3.9090 1.3992 11.6027 13.0747 0.1363 0.4147 0.7333 0.5872 5.4590 15.3878 0.3829 66.1821 1.9093 14.1045 37.5993 25.8753 6.3879 2.4853 14.2587 0.0230 18.3348 4.3991 12.4907 68.0652 259.7231 3.9758 8.1279 63.4146 34.7937 1.8845 0.0009 30.9398 17.9713 50.1743 3.7037 56.6476 32.3361 28.8266
temp: 298.150 k
press: 1.00000 atm
elementType: 8 7 7 6 6 6 6 6 6 6 1 1 1 1 1 1 1 1 1 1 1 1
symmnumber: 1
zpe: 478039.6 jmol-1
zpe.correction: 0.182076 hartree
zpe.thermalcorrener: 0.194081 hartree
zpe.thermalcorrenthalpy: 0.195025 hartree
zpe.thermalcorrgfe: 0.144060 hartree
zpe.sumelectzpe: -457.884140 hartree
zpe.sumelectthermal: -457.872135 hartree
zpe.sumelectthermalent: -457.871191 hartree
zpe.sumelectthermalfe: -457.922155 hartree
dipole: 0.0035 4.3496 -5.9173
dipole: 7.3440
quadrupole: -57.8764 -61.2514 -67.6784
quadrupole: 0.0029 0.0029 2.0188
quadrupole: 4.3923 1.0173 -5.4096 0.0029 0.0029 2.0188
hfenergy: -458.0662154 hartree
pointgroup: C01 [X(C7H12N2O1)]
dipole: 0.0069585 1.8729795 2.200045 debye
dipolederiv: -0.3120805 -0.0009065 0.000441 -0.0010066 -0.5841622 0.0561134 -0.0003604 -0.1557856 -0.9439501 -0.6931099 -0.0011262 -0.0014435 -0.0009839 -1.0067562 -0.3621911 -0.0006447 -0.1431211 -0.3699344 -0.2343198 -0.0001562 -0.0000561 -0.000128 -0.270461 -0.0152543 0.000087 0.0188085 -0.1920344 0.0527744 0.0001391 0.000264 0.000097 0.0644609 0.0808844 0.0004827 0.1294091 -0.0846393 0.141232 0.0070078 0.0766765 -0.0144749 0.0643115 -0.0067578 0.0796148 0.0143473 0.1183299 0.1411543 -0.0076562 -0.0766393 0.0139339 0.0643011 -0.0061601 -0.0794485 0.0150404 0.1183147 0.1734977 0.0039966 0.0003581 0.0039069 1.2920525 0.1823978 0.0001882 0.1380476 1.1357425 -0.0814572 0.0046429 0.0388083 0.0038688 0.0563448 -0.0121165 0.0016078 -0.0170198 0.0185973 -0.0815267 -0.003548 -0.038885 -0.0027913 0.0563783 -0.0118351 -0.0017265 -0.0170073 0.0185973 -0.0655708 0.0007292 0.0002942 0.0007292 0.1171664 0.0772137 0.0000883 0.0283663 -0.0530277 0.0045054 0.0279813 0.0217278 0.038406 -0.1045229 -0.1433861 0.016832 -0.1215561 -0.0081279 0.02706 -0.0148259 0.018011 -0.0162339 -0.0412215 0.1348903 0.0137623 0.1129268 -0.0267721 0.0039704 -0.0288586 -0.0228682 -0.0393195 -0.1040672 -0.14323 -0.0178168 -0.1214419 -0.0081221 0.0273179 0.0143179 -0.0169737 0.015702 -0.0414741 0.1350287 -0.012892 0.1129975 -0.0267162 -0.1176923 -0.0044405 -0.1066247 -0.0058452 0.103147 -0.0018459 -0.13436 -0.0004307 -0.007874 0.0907226 0.0118936 0.0122448 -0.0282438 -0.060964 0.1073736 0.041649 0.1020623 0.0038131 0.1002792 -0.01139 0.00655 0.0249607 -0.0447229 -0.090258 0.0383765 -0.0883315 0.0307475 0.1001615 0.0102297 -0.0072573 -0.0261222 -0.0445359 -0.0902142 -0.0390769 -0.0880476 0.0307043 -0.1175463 0.0061527 0.1066249 0.0075364 0.1030516 -0.0026456 0.1343688 -0.0014526 -0.0079182 0.0908369 -0.0130657 -0.0114287 0.0271114 -0.0611434 0.1074586 -0.0408399 0.1023715 0.0038658 0.3837315 -0.0004623 0.0000869 -0.0004573 0.2491919 0.0021824 0.0000496 -0.0110958 0.0911649 0.3660599 -0.0006548 0.0000888 -0.0006458 0.1936255 0.0023518 0.0000586 -0.0090872 0.1592392 unknown
polarizability: 81.5563264|0.0421331|92.8298221|0.0245322|7.6770272|83.4756741 unknown
InChI: InChI=1S/C7H12N2O/c1-3-7(4-2,5-8)6(9)10/h3-4,9H2,1-2H3
charge 0 multiplicity 1
22 atoms
O  0.003854 0.859376 -1.889408
N  0.008528 2.295591 -0.075726
N  -0.010048 -2.492484 -0.879934
C  -0.00051 -0.143543 0.392909
C  1.287466 -0.094336 1.294536
C  -1.28783 -0.084224 1.294868
C  0.004008 1.030256 -0.640443
C  2.614304 -0.119233 0.510877
C  -2.614991 -0.098475 0.511483
C  -0.005649 -1.42396 -0.35168
H  1.233885 0.816485 1.924054
H  1.242053 -0.956229 1.987622
H  -1.2269 0.8261 1.924436
H  -1.249048 -0.946523 1.987838
H  3.471726 -0.106181 1.207101
H  2.706853 0.753653 -0.159951
H  2.692403 -1.030237 -0.108236
H  -2.700328 -1.008654 -0.107889
H  -3.472147 -0.078912 1.20788
H  -2.700818 0.775317 -0.159059
H  0.008681 2.456129 0.929521
H  0.011807 3.098384 -0.704701
