program: Gaussian 09
title: 000029234
version: EM64L-G09RevD.01
frameworkgroup: C1[X(C13H17ClN2O5S)]
method: RPBEPBE
basis: SDD
operation: Freq
keyword: #p
keyword: freq=noraman
keyword: PBEPBE/SDD
title: #p freq=noraman PBEPBE/SDD
converged: YES YES NO NO
title: Mulliken charges:
elementType: Cl S O O O O O N N C C C C C C C C C C C C C H H H H H H H H H H H H H H H H H
charge: -0.011641 0.935108 -0.282648 -0.431724 -0.546304 -0.514558 -0.301602 -0.397375 -0.708736 -0.010033 -0.407614 -0.426688 -0.375788 -0.428398 -0.299373 0.333759 0.099609 -0.292645 -0.041527 -0.306861 -0.116943 0.138810 0.206049 0.204212 0.207481 0.199893 0.225409 0.213943 0.203188 0.236051 0.212850 0.226683 0.182563 0.404661 0.272900 0.335687 0.341597 0.329316 0.390686
chargesum: 0.00000
title: Mulliken charges with hydrogens summed into heavy atoms:
elementType: Cl S O O O O O N N C C C C C C C C C C C C C
charge: -0.011641 0.935108 -0.282648 -0.041039 -0.546304 -0.514558 -0.301602 0.007286 -0.037823 0.196016 0.004080 -0.001386 0.041343 0.020503 0.109874 0.333759 0.099609 -0.019745 -0.041527 0.028826 -0.116943 0.138810
polarizability: 3.08733550e+02 1.51098207e+01 2.30164621e+02 -2.63392736e+00 2.44840849e-01 1.27643221e+02
1716.lowfreq: -0.0015 0.0012 0.0020 1.9063 5.6004 7.8972 20.1687 34.9420 46.7642
frequency: 20.0366 34.7775 46.7340 49.1527 56.9128 84.7834 99.3777 107.8110 125.4161 132.0003 136.7577 167.3186 178.7265 197.0811 219.7716 227.7500 232.2271 234.5647 268.7691 284.9193 307.1539 307.7778 318.3204 373.3451 382.0283 407.1453 420.4445 442.9107 447.0702 458.9984 469.5037 473.8226 508.8068 555.1234 564.8645 609.3588 619.3057 628.4157 651.6102 696.4028 750.2854 757.7779 772.0568 794.8546 807.0180 817.2125 825.9262 847.6237 856.3266 864.1190 894.1830 918.5181 930.5179 953.0425 968.1145 984.4580 1005.0156 1026.3861 1059.5652 1069.1867 1079.3434 1097.2433 1104.3805 1113.9684 1134.2582 1139.8599 1167.0449 1188.2891 1228.8655 1244.6815 1254.5997 1259.6605 1270.6779 1290.4627 1327.3469 1331.6075 1339.8649 1340.6306 1345.8464 1365.0075 1373.7142 1395.2600 1423.2713 1440.7845 1446.1383 1455.3129 1460.2786 1467.6005 1471.7182 1505.7971 1525.0389 1566.9904 1590.4912 1631.6364 2913.1233 2939.9711 2954.9990 2973.1527 2981.0555 2989.7647 3020.0430 3041.1121 3046.5788 3057.5644 3084.7061 3159.2468 3185.3864 3333.9760 3368.6113 3539.5850 3539.7702
redmass: 6.1133 4.0002 4.8245 5.9021 7.1933 8.4340 5.2992 6.4406 2.6161 4.5529 2.6966 7.0383 5.5609 4.3050 4.3319 4.3712 2.9593 2.8908 3.7051 7.1737 13.9240 8.3983 1.7434 7.5885 6.5405 5.7351 6.4422 3.0914 3.1198 3.6786 4.0285 2.9220 5.8261 2.0847 1.2512 3.5346 5.8011 6.0068 6.2142 4.1080 2.8268 3.0696 3.3904 1.8252 13.0311 1.4460 1.3801 2.6521 2.0019 1.7083 4.4249 4.3111 2.6355 2.0914 1.3959 1.4501 5.2788 2.9037 2.3194 1.5812 2.9463 2.1707 2.0376 2.2243 2.2019 2.2998 1.4081 1.4790 1.2125 1.5693 1.2290 1.4856 1.3012 1.2807 1.3867 2.1115 1.4545 1.3444 1.4234 1.2902 1.7572 6.8530 2.8605 2.7232 1.1027 1.0907 1.0903 1.0971 1.0973 6.3741 1.0888 5.3011 3.9244 6.9731 1.0827 1.0692 1.0610 1.0638 1.0605 1.0609 1.0998 1.0978 1.1017 1.1025 1.0962 1.0913 1.0914 1.0792 1.0411 1.1003 1.0645
irintensity: 0.5351 0.9426 1.0255 1.5344 0.9648 1.1380 3.4768 0.9108 12.8952 8.3672 6.4619 0.5360 3.1783 1.6853 1.4924 11.1550 6.6564 1.8285 1.2337 0.6930 7.5709 1.3456 3.4297 10.5692 10.0791 53.7336 63.4204 2.1605 2.8125 37.4227 163.9403 10.1290 22.8327 14.5708 105.4650 2.3567 10.2210 41.7782 9.3226 10.3452 8.4743 8.0712 14.0784 140.9051 73.3707 23.4291 77.8632 7.3200 35.9806 15.0899 32.1362 83.8081 49.9128 17.8663 10.6836 6.0713 268.2223 107.4662 17.0684 12.6078 47.0720 13.4845 49.5489 35.9846 40.3057 111.3609 7.0283 34.4359 13.6707 31.8835 5.1460 13.1267 4.1166 4.3991 48.6909 123.9129 2.3147 3.5133 8.7243 5.7053 9.3539 6.3674 59.0214 14.3558 1.9801 19.1092 9.5519 73.4636 6.1098 83.3247 38.9780 254.8194 156.3471 667.5086 28.3187 60.1154 51.4740 36.9561 30.5371 35.9043 15.6577 45.0692 36.8439 75.0252 34.3184 21.0345 2.0061 182.1985 27.5152 18.5578 73.6273
temp: 298.150 k
press: 1.00000 atm
elementType: 17 16 8 8 8 8 8 7 7 6 6 6 6 6 6 6 6 6 6 6 6 6 1 1 1 1 1 1 1 1 1 1 1 1 1 1 1 1 1
symmnumber: 1
zpe: 771327.0 jmol-1
zpe.correction: 0.293783 hartree
zpe.thermalcorrener: 0.316478 hartree
zpe.thermalcorrenthalpy: 0.317422 hartree
zpe.thermalcorrgfe: 0.240418 hartree
zpe.sumelectzpe: -1847.492067 hartree
zpe.sumelectthermal: -1847.469372 hartree
zpe.sumelectthermalent: -1847.468428 hartree
zpe.sumelectthermalfe: -1847.545432 hartree
dipole: 7.6280 -1.9487 1.5890
dipole: 8.0318
quadrupole: -135.5022 -136.0490 -148.5870
quadrupole: 0.4031 -21.2265 -2.7409
quadrupole: 4.5439 3.9970 -8.5409 0.4031 -21.2265 -2.7409
hfenergy: -1847.7858498 hartree
pointgroup: C01 [X(C13H17Cl1N2O5S1)]
dipole: 3.0304516 0.6679394 -0.5961996 debye
polarizability: 307.6212013|-17.5374576|231.1948165|4.6923762|-0.6238067|127.7253739 unknown
InChI: InChI=1S/C13H17ClN2O5S/c14-10-6-11(16-7-8-3-1-2-4-21-8)9(13(17)18)5-12(10)22(15,19)20/h5-6,8,16-17H,1-4,7,15H2
charge 0 multiplicity 1
39 atoms
Cl -2.894612 2.999269 -0.1863
S  -4.802655 0.19297 0.066286
O  3.949512 -0.457203 -0.558516
O  -1.204422 -3.569497 0.122005
O  -5.257941 -1.370087 0.014207
O  -5.326054 1.183292 1.241764
O  0.963306 -2.755731 0.054221
N  1.284728 -0.073164 0.018051
N  -5.265067 0.880743 -1.57527
C  3.605029 0.647177 0.359947
C  4.640213 1.78562 0.265752
C  6.059766 1.238697 0.557394
C  6.37918 0.03538 -0.362284
C  2.188299 1.080302 -0.037851
C  5.27408 -1.031154 -0.250102
C  -0.080009 0.003652 -0.007738
C  -0.906482 -1.19033 0.031896
C  -0.744382 1.276439 -0.075531
C  -2.926252 0.184981 -0.000904
C  -2.315867 -1.071064 0.03379
C  -2.136253 1.354223 -0.067607
C  -0.28324 -2.520226 0.068502
H  3.590799 0.247614 1.401836
H  4.379676 2.5905 0.980639
H  4.607651 2.215927 -0.754613
H  6.117828 0.917012 1.617845
H  6.811632 2.037798 0.423463
H  6.447121 0.375418 -1.41358
H  7.354355 -0.414415 -0.093157
H  2.21389 1.514717 -1.059715
H  1.853106 1.87018 0.662454
H  5.405296 -1.846687 -0.979598
H  5.256562 -1.46277 0.775735
H  1.707967 -1.014843 -0.049227
H  -0.164254 2.197736 -0.152958
H  -2.939542 -1.970523 0.067353
H  -6.003759 0.27219 -1.96626
H  -5.554676 1.865004 -1.45712
H  -0.708427 -4.430845 0.140492
