program: Gaussian 09
title: 000029243
version: EM64L-G09RevD.01
frameworkgroup: C1[X(C9H16N2O6)]
method: RPBEPBE
basis: SDD
operation: Freq
keyword: #p
keyword: freq=noraman
keyword: PBEPBE/SDD
title: #p freq=noraman PBEPBE/SDD
converged: YES YES NO NO
title: Mulliken charges:
elementType: O O O O O O N N C C C C C C C C C H H H H H H H H H H H H H H H H
charge: -0.307889 -0.471887 -0.458933 -0.449202 -0.430491 -0.382648 -0.176952 -0.394588 -0.047512 -0.205359 -0.113873 -0.043079 -0.369376 -0.413446 -0.367047 0.323711 -0.149720 0.269268 0.228193 0.255931 0.276341 0.245679 0.273481 0.231957 0.238137 0.214886 0.195599 0.236551 0.333839 0.390065 0.369996 0.352850 0.345517
chargesum: 0.00000
title: Mulliken charges with hydrogens summed into heavy atoms:
elementType: O O O O O O N N C C C C C C C C C
charge: -0.307889 -0.081823 -0.088936 -0.096353 -0.084974 -0.382648 -0.176952 -0.060750 0.221757 0.022834 0.142058 0.233262 0.149784 0.056648 0.043438 0.323711 0.086831
polarizability: 1.54484050e+02 -1.71299620e-01 1.31428075e+02 -2.24951817e+00 2.53398995e-01 9.55459222e+01
1716.lowfreq: -0.0003 0.0002 0.0003 2.3554 8.4380 17.9457 27.1059 40.4446 60.1476
frequency: 27.0078 40.3502 60.1168 75.6554 97.7908 142.7394 156.5607 181.8624 190.8469 218.5725 228.0574 245.8425 259.4202 284.9845 304.7691 310.7970 370.7658 396.2928 438.9220 450.5006 459.5379 501.3031 523.7607 553.0261 560.3813 574.5483 581.1698 644.2322 714.9593 721.0304 734.2025 790.1497 803.4380 837.2225 871.8169 887.9679 906.6375 914.1663 934.4221 980.2505 984.9971 1008.1819 1016.1739 1039.9634 1060.7488 1063.4276 1074.7396 1084.7942 1094.8081 1150.9481 1173.6224 1175.4721 1184.8798 1192.0272 1215.7334 1224.0288 1249.9502 1259.9879 1265.3199 1285.1453 1310.7845 1313.4094 1316.7572 1331.2167 1342.5919 1345.5576 1354.3387 1364.5057 1390.3445 1398.6207 1409.1949 1436.1804 1448.7591 1461.9722 1475.0785 1506.6932 1601.9619 2944.7329 2977.7493 2994.1935 2995.5729 2997.2610 3008.4185 3024.1941 3031.8345 3084.6735 3103.0691 3108.7179 3157.9919 3416.9391 3559.9506 3562.2969 3585.6042
redmass: 5.6167 5.8140 4.3714 5.0766 5.1895 8.0008 5.0512 4.9084 2.6603 2.0157 1.8572 4.0334 1.1608 5.5301 4.0550 4.7685 4.4096 2.5440 5.2830 4.0081 3.7907 4.5373 4.1337 1.2034 1.2157 5.3405 4.9868 5.0938 8.9645 5.3884 2.5901 1.5494 2.1343 3.0800 3.5234 2.9813 2.5960 2.6796 2.6328 5.8034 3.5084 2.9918 3.1734 3.5840 2.2629 3.9583 2.1998 2.2069 2.1932 1.7557 1.3368 1.1543 1.6726 1.5278 1.5314 1.2440 1.3434 1.4119 1.2700 1.2158 1.2040 1.3311 1.3164 1.2489 1.4175 1.4095 1.3373 1.4912 1.6432 1.9076 1.4999 1.3724 1.1049 1.8258 1.0872 1.5993 3.8069 1.0584 1.0837 1.0817 1.0798 1.0786 1.1028 1.0879 1.0635 1.0883 1.0998 1.0974 1.0672 1.0642 1.0665 1.0773 1.0670
irintensity: 0.4778 0.9917 0.4129 11.7883 3.1395 3.3853 5.3042 14.8745 44.2945 77.1048 43.3064 20.0075 162.1315 2.9634 12.0608 21.5264 7.4733 12.0856 16.4206 14.3875 30.7863 8.4567 44.9560 105.4564 103.2485 14.8622 6.8124 16.7468 33.5967 1.9543 31.0395 58.1658 70.5077 41.0900 45.8936 18.9206 110.8055 7.6718 30.0886 37.1757 113.3304 4.5564 128.5962 104.7364 21.6444 44.2654 15.3216 4.8233 19.5773 27.1634 27.3928 13.2817 31.5958 41.6541 64.0458 9.6538 129.3915 7.3030 13.7373 7.9494 6.8320 115.3982 5.2055 20.6626 16.5601 62.8804 23.3030 5.4106 49.2325 181.1489 2.0121 115.3648 9.5234 111.3963 5.8215 173.2141 252.2064 58.7527 16.3898 8.8608 72.3171 31.1996 41.4299 45.1980 35.0746 22.8099 15.7565 6.3289 517.9362 42.7191 7.5219 40.9531 5.1917
temp: 298.150 k
press: 1.00000 atm
elementType: 8 8 8 8 8 8 7 7 6 6 6 6 6 6 6 6 6 1 1 1 1 1 1 1 1 1 1 1 1 1 1 1 1
symmnumber: 1
zpe: 694684.6 jmol-1
zpe.correction: 0.264591 hartree
zpe.thermalcorrener: 0.281386 hartree
zpe.thermalcorrenthalpy: 0.282330 hartree
zpe.thermalcorrgfe: 0.219635 hartree
zpe.sumelectzpe: -912.040385 hartree
zpe.sumelectthermal: -912.023590 hartree
zpe.sumelectthermalent: -912.022646 hartree
zpe.sumelectthermalfe: -912.085341 hartree
dipole: -6.0142 -4.2613 1.1940
dipole: 7.4669
quadrupole: -94.4933 -101.5368 -99.3519
quadrupole: -13.1695 3.9063 -2.1899
quadrupole: 3.9673 -3.0761 -0.8912 -13.1695 3.9063 -2.1899
hfenergy: -912.3049764 hartree
pointgroup: C01 [X(C9H16N2O6)]
dipole: 2.2805151 -1.7842537 -0.4958418 debye
polarizability: 154.3636865|-0.8865732|131.4561153|-3.2114053|-0.3615571|95.6382457 unknown
InChI: InChI=1S/C9H16N2O6/c12-3-4-6(14)7(15)8(17-4)11-2-1-5(13)10-9(11)16/h4-8,10,12-15H,1-3H2
charge 0 multiplicity 1
33 atoms
O  -1.216422 -0.706125 1.14433
O  -1.133943 2.412094 -0.741488
O  -3.227915 1.640018 0.670385
O  -4.057594 -1.994134 -0.876334
O  3.695005 -1.584762 -1.317064
O  1.476549 2.15869 -0.270428
N  0.930935 -0.04315 0.306407
N  3.158058 0.560117 -0.253948
C  -0.451986 0.424099 0.625231
C  -1.245643 0.972654 -0.602053
C  -2.71135 0.620568 -0.238463
C  -2.583026 -0.708316 0.520524
C  1.328779 -1.469802 0.432787
C  2.791719 -1.564454 0.899065
C  -2.679709 -1.956794 -0.368825
C  1.821772 0.932064 -0.082832
C  3.689502 -0.785092 -0.071149
H  -0.385304 1.217902 1.396495
H  -0.920529 0.442251 -1.520808
H  -3.362183 0.518127 -1.126603
H  -3.323579 -0.756491 1.334857
H  1.224614 -1.982496 -0.542876
H  0.643119 -1.944695 1.149092
H  2.905299 -1.153597 1.917892
H  3.112084 -2.618975 0.902446
H  -2.443929 -2.847923 0.247963
H  -1.945461 -1.896051 -1.201403
H  4.72627 -0.697269 0.310409
H  3.767279 1.330057 -0.534531
H  -0.149818 2.620531 -0.613051
H  -2.772198 2.487801 0.397934
H  -4.232056 -2.865811 -1.309673
H  4.171361 -1.085037 -2.028389
